program: Orca
programVersion: 5.0.2
elementType: O N N N N N C C C C C C C C C C C C C C C C H H H H H H H H H H H H H H H H H H H H H H H
charge: 0
multiplicity: 1
keywords: wb97x-d3
keywords: def2-TZVPP
keywords: def2/J RIJCOSX
keywords: DEFGRID2
keywords: scfconv7
keywords: smallprint printgap noloewdin
keywords: NOSOSCF
formula: C16H23N5O
InChI: InChI=1/C16H23N5O/c1-6-20(14-7-8-17-18-9-14)16(22)15-10-19-21(13(15)5)12(4)11(2)3/h7-12H,6H2,1-5H3
45 atoms
O  1.450563 -2.805339 0.269406
N  -2.07353 -0.571995 -0.485903
N  -1.539782 0.116732 -1.499162
N  2.455182 -0.852334 -0.275077
N  1.587769 2.487588 0.955689
N  2.228646 3.279438 0.121617
C  -3.496773 -0.419939 -0.205337
C  -3.803805 1.026005 0.215419
C  -4.307613 -0.899694 -1.400903
C  -1.167146 -1.295814 0.191618
C  -5.268011 1.167933 0.617844
C  -2.900057 1.484928 1.354873
C  0.051942 -1.041987 -0.424541
C  -0.256992 -0.149636 -1.470427
C  -1.502212 -2.127803 1.375171
C  1.345872 -1.643113 -0.090146
C  3.784394 -1.466269 -0.232515
C  2.393336 0.545128 -0.188739
C  4.404327 -1.437371 1.151814
C  3.086634 1.374641 -1.041892
C  1.664996 1.181082 0.826175
C  2.959769 2.743627 -0.836867
H  -3.707392 -1.073873 0.643827
H  -3.621508 1.670527 -0.651191
H  -5.365142 -0.958985 -1.149303
H  -4.199363 -0.229516 -2.254152
H  -3.991911 -1.897543 -1.707297
H  -5.950406 0.970363 -0.208891
H  -5.470558 2.182649 0.963794
H  -5.524346 0.486685 1.433085
H  -1.843966 1.492401 1.08046
H  -3.014977 0.848329 2.235837
H  -3.155241 2.502663 1.654679
H  0.406095 0.277548 -2.208156
H  -2.021236 -1.547019 2.138339
H  -2.143761 -2.968268 1.105263
H  -0.600997 -2.534385 1.824982
H  3.696146 -2.487795 -0.595587
H  4.422175 -0.941633 -0.943823
H  5.390957 -1.901261 1.123085
H  4.532195 -0.416409 1.514816
H  3.798105 -1.983756 1.874362
H  3.693985 0.999772 -1.854712
H  1.130254 0.603854 1.570746
H  3.468411 3.443041 -1.488431
elementType: O N C H
totalener: -972.61765065 hartree
nucrepener: 1884.70905917 hartree
electener: -2857.32670982 hartree
oneelecener: -5063.32759243 hartree
twoeener: 2206.00088261 hartree
cpcmener: -0.03769492 hartree
kineticenergy: 968.29158217 hartree
xcener: -95.344781997023 hartree
chargesum: -0.0000000
charge: -0.497845 0.201401 -0.358359 -0.047516 -0.170859 -0.216162 0.016460 0.078326 -0.301420 -0.063564 -0.303834 -0.297439 -0.093122 -0.087611 -0.266943 0.405897 -0.040053 0.029871 -0.251226 -0.135791 -0.005978 0.009184 0.090434 0.045241 0.100711 0.097566 0.102653 0.096603 0.092341 0.088580 0.082897 0.085724 0.100598 0.160323 0.115258 0.124000 0.099307 0.091419 0.103686 0.099403 0.089796 0.088909 0.155981 0.136215 0.148939
qa: -0.4978 0.2014 -0.3584 -0.0475 -0.1709 -0.2162 0.0165 0.0783 -0.3014 -0.0636 -0.3038 -0.2974 -0.0931 -0.0876 -0.2669 0.4059 -0.0401 0.0299 -0.2512 -0.1358 -0.0060 0.0092 0.0904 0.0452 0.1007 0.0976 0.1027 0.0966 0.0923 0.0886 0.0829 0.0857 0.1006 0.1603 0.1153 0.1240 0.0993 0.0914 0.1037 0.0994 0.0898 0.0889 0.1560 0.1362 0.1489
va: 2.0011 3.2961 2.8894 3.0625 2.9608 2.9532 3.8752 3.7789 3.9651 3.9778 3.9481 3.9478 3.4133 4.1208 3.9700 4.0561 3.8523 3.7820 3.8968 3.9541 4.0934 4.0808 1.0053 1.0322 1.0008 1.0075 1.0065 1.0013 1.0051 0.9995 1.0048 1.0029 1.0070 1.0026 0.9917 0.9921 1.0194 1.0194 1.0000 1.0070 1.0004 1.0128 0.9983 1.0196 1.0041
dispcorr: -0.024299076 hartree
energy: -972.641949721175
dipole: -19.08524 19.23733 0.15209 -3.45057 2.50542 -0.94515 6.29659 -6.65506 -0.35847
magnitude: 1.02223 au
magnitude: 2.59829 debye
