program: Orca
programVersion: 5.0.2
elementType: O N N N N N C C C C C C C C C C C C C C C C H H H H H H H H H H H H H H H H H H H H H H H
charge: 0
multiplicity: 1
keywords: wb97x-d3
keywords: def2-TZVPP
keywords: def2/J RIJCOSX
keywords: DEFGRID2
keywords: scfconv7
keywords: smallprint printgap noloewdin
keywords: NOSOSCF
formula: C16H23N5O
InChI: InChI=1/C16H23N5O/c1-6-20(14-7-8-17-18-9-14)16(22)15-10-19-21(13(15)5)12(4)11(2)3/h7-12H,6H2,1-5H3
45 atoms
O  1.848779 -2.656112 -1.141999
N  -2.049297 -0.695367 -0.257414
N  -1.997959 -1.008901 -1.554124
N  2.257548 -0.963039 0.305355
N  2.155885 2.188858 2.169084
N  1.665048 3.03649 1.297894
C  -3.293727 -0.188573 0.304485
C  -3.582012 1.263829 -0.124572
C  -4.435217 -1.152744 0.019824
C  -0.866602 -0.861814 0.369036
C  -2.395668 2.17434 0.170793
C  -4.033285 1.42187 -1.572524
C  0.013511 -1.307511 -0.604587
C  -0.76625 -1.395907 -1.772775
C  -0.672215 -0.659264 1.82956
C  1.426008 -1.703583 -0.525976
C  3.613703 -1.471213 0.528577
C  2.033029 0.390639 0.582986
C  4.604156 -1.002759 -0.524131
C  1.53861 1.293533 -0.338422
C  2.335118 0.925135 1.840436
C  1.369031 2.604454 0.084653
H  -3.136059 -0.16231 1.384987
H  -4.412534 1.580104 0.51753
H  -4.240271 -2.125507 0.470529
H  -5.36257 -0.765498 0.442255
H  -4.579015 -1.302615 -1.047681
H  -1.541147 1.934002 -0.463986
H  -2.06932 2.107562 1.210255
H  -2.655634 3.216305 -0.017295
H  -3.259319 1.113764 -2.273324
H  -4.272433 2.467226 -1.771953
H  -4.92785 0.840295 -1.792701
H  -0.453342 -1.721204 -2.752633
H  -0.630043 0.397026 2.100317
H  -1.472496 -1.120403 2.409209
H  0.258003 -1.120616 2.149943
H  3.939385 -1.153755 1.519541
H  3.563914 -2.557528 0.547138
H  4.324663 -1.366317 -1.511238
H  4.668039 0.085495 -0.558588
H  5.599817 -1.38328 -0.295975
H  1.288672 1.006803 -1.350281
H  2.729685 0.299061 2.632252
H  0.980276 3.355032 -0.592197
totalener: -972.58631063 hartree
nucrepener: 1924.39312976 hartree
electener: -2896.97944039 hartree
oneelecener: -5142.08117773 hartree
twoeener: 2245.10173734 hartree
kineticenergy: 968.35564932 hartree
xcener: -95.352902019559 hartree
chargesum: 0.0000000
charge: -0.367950 0.207245 -0.330510 -0.074822 -0.109883 -0.139006 0.015064 0.038109 -0.285541 -0.082897 -0.302792 -0.262113 -0.051010 -0.075051 -0.289337 0.329791 -0.040052 0.037519 -0.249302 -0.102984 -0.087209 -0.048513 0.087300 0.040710 0.096904 0.091490 0.106160 0.071409 0.096968 0.102967 0.096207 0.084298 0.082151 0.138260 0.119405 0.118286 0.106257 0.087684 0.097983 0.101670 0.083612 0.090821 0.125053 0.114206 0.131443
qa: -0.3679 0.2072 -0.3305 -0.0748 -0.1099 -0.1390 0.0151 0.0381 -0.2855 -0.0829 -0.3028 -0.2621 -0.0510 -0.0751 -0.2893 0.3298 -0.0401 0.0375 -0.2493 -0.1030 -0.0872 -0.0485 0.0873 0.0407 0.0969 0.0915 0.1062 0.0714 0.0970 0.1030 0.0962 0.0843 0.0822 0.1383 0.1194 0.1183 0.1063 0.0877 0.0980 0.1017 0.0836 0.0908 0.1251 0.1142 0.1314
va: 2.1375 3.2635 2.8448 2.9852 3.0117 2.9452 3.9048 3.8542 3.9594 3.8879 3.9542 3.9308 3.3997 4.1166 3.9671 4.1241 3.8750 3.7441 3.8952 3.8836 4.1405 4.0759 1.0009 1.0173 1.0089 1.0024 1.0098 1.0035 1.0057 1.0112 1.0208 1.0063 1.0066 1.0116 0.9886 1.0009 1.0128 1.0014 1.0177 1.0142 1.0015 1.0101 1.0173 1.0193 1.0049
dispcorr: -0.026741284 hartree
energy: -972.613051914028
dipole: -15.00221 14.44128 -0.56093 3.30578 -3.42409 -0.11830 -0.06812 0.43776 0.36964
magnitude: 0.68211 au
magnitude: 1.73378 debye
