program: Orca
programVersion: 5.0.2
elementType: O N N N N N C C C C C C C C C C C C C C C C H H H H H H H H H H H H H H H H H H H H H H H
charge: 0
multiplicity: 1
keywords: wb97x-d3
keywords: def2-TZVPP
keywords: def2/J RIJCOSX
keywords: DEFGRID2
keywords: scfconv7
keywords: smallprint printgap noloewdin
keywords: NOSOSCF
formula: C16H23N5O
InChI: InChI=1/C16H23N5O/c1-6-20(14-7-8-17-18-9-14)16(22)15-10-19-21(13(15)5)12(4)11(2)3/h7-12H,6H2,1-5H3
45 atoms
O  1.641059 -2.809686 1.057308
N  -1.858884 -0.153812 0.293796
N  -1.995105 -0.689733 1.506579
N  2.426652 -0.884563 0.171668
N  1.515125 2.615774 0.807614
N  2.069032 3.24684 -0.203604
C  -2.932391 0.681833 -0.227249
C  -4.25368 -0.097918 -0.262905
C  -2.982782 1.976117 0.576751
C  -0.654497 -0.394172 -0.257117
C  -5.373624 0.759092 -0.84556
C  -4.106318 -1.389183 -1.062041
C  0.040876 -1.14288 0.679206
C  -0.866184 -1.310976 1.742238
C  -0.280604 0.05549 -1.624498
C  1.403139 -1.69081 0.663208
C  3.70385 -1.539088 -0.117612
C  2.334065 0.497966 0.027722
C  3.703186 -2.300158 -1.433297
C  2.957392 1.175092 -1.003577
C  1.645557 1.31337 0.941742
C  2.786915 2.551959 -1.064231
H  -2.657837 0.922321 -1.258313
H  -4.512745 -0.356395 0.768031
H  -3.310638 1.784072 1.597984
H  -1.99688 2.440286 0.619639
H  -3.66442 2.693387 0.123398
H  -5.596082 1.631983 -0.233152
H  -6.293698 0.179278 -0.92178
H  -5.126611 1.109201 -1.851118
H  -5.052332 -1.93043 -1.092936
H  -3.364382 -2.060247 -0.630876
H  -3.817299 -1.183417 -2.096319
H  -0.709806 -1.847664 2.664894
H  -0.113578 1.133389 -1.672692
H  0.631989 -0.437619 -1.948888
H  -1.054039 -0.195664 -2.351211
H  4.477844 -0.772233 -0.114363
H  3.93127 -2.217339 0.703493
H  2.959071 -3.094805 -1.426254
H  3.4961 -1.647641 -2.282597
H  4.676806 -2.761647 -1.598699
H  3.537024 0.667057 -1.762546
H  1.17799 0.894955 1.822997
H  3.241722 3.126824 -1.861634
totalener: -972.58723433 hartree
nucrepener: 1902.71587403 hartree
electener: -2875.30310836 hartree
oneelecener: -5098.80135923 hartree
twoeener: 2223.49825087 hartree
kineticenergy: 968.34696136 hartree
xcener: -95.350764450121 hartree
chargesum: 0.0000000
charge: -0.361766 0.243826 -0.311962 -0.067993 -0.104348 -0.161492 -0.038778 0.065015 -0.275708 -0.127857 -0.276333 -0.283585 0.000810 -0.094341 -0.278760 0.297567 -0.056457 0.106814 -0.253807 -0.138455 -0.110650 -0.039671 0.076278 0.056980 0.106423 0.101183 0.088483 0.092714 0.086123 0.079004 0.090504 0.103581 0.067670 0.138964 0.120244 0.096301 0.118315 0.094449 0.108271 0.107115 0.064520 0.094690 0.131464 0.122413 0.122243
qa: -0.3618 0.2438 -0.3120 -0.0680 -0.1043 -0.1615 -0.0388 0.0650 -0.2757 -0.1279 -0.2763 -0.2836 0.0008 -0.0943 -0.2788 0.2976 -0.0565 0.1068 -0.2538 -0.1385 -0.1106 -0.0397 0.0763 0.0570 0.1064 0.1012 0.0885 0.0927 0.0861 0.0790 0.0905 0.1036 0.0677 0.1390 0.1202 0.0963 0.1183 0.0944 0.1083 0.1071 0.0645 0.0947 0.1315 0.1224 0.1222
va: 2.1415 3.2365 2.8584 3.0519 2.9728 2.9683 3.9474 3.7789 3.9549 3.8931 3.9421 3.9365 3.3714 4.1417 3.9845 4.1648 3.8380 3.7561 3.9103 3.8691 4.1423 4.1230 1.0065 1.0341 1.0078 1.0145 1.0036 1.0049 1.0090 1.0012 1.0093 1.0088 1.0065 1.0127 0.9864 1.0077 1.0016 0.9979 1.0218 1.0063 1.0056 1.0106 1.0074 1.0230 1.0086
dispcorr: -0.025441086 hartree
energy: -972.612675414741
dipole: -18.11039 18.41941 0.30902 -1.87692 1.71298 -0.16394 -13.77436 12.02599 -1.74837
magnitude: 1.78302 au
magnitude: 4.53208 debye
