program: Orca
programVersion: 5.0.2
elementType: O N N N N N C C C C C C C C C C C C C C C C H H H H H H H H H H H H H H H H H H H H H H H
charge: 0
multiplicity: 1
keywords: wb97x-d3
keywords: def2-TZVPP
keywords: def2/J RIJCOSX
keywords: DEFGRID2
keywords: scfconv7
keywords: smallprint printgap noloewdin
keywords: NOSOSCF
formula: C16H23N5O
InChI: InChI=1/C16H23N5O/c1-6-20(14-7-8-17-18-9-14)16(22)15-10-19-21(13(15)5)12(4)11(2)3/h7-12H,6H2,1-5H3
45 atoms
O  1.599363 -2.834324 0.778524
N  -1.887159 -0.082961 0.364229
N  -1.904587 -0.620793 1.584437
N  2.302724 -0.97594 -0.308599
N  2.669048 2.446597 -1.563468
N  2.279172 3.180215 -0.549546
C  -3.014303 0.74069 -0.050746
C  -4.313121 -0.0779 -0.043901
C  -3.059275 1.993889 0.815281
C  -0.757489 -0.353927 -0.316573
C  -5.490499 0.769321 -0.518495
C  -4.179156 -1.328382 -0.907075
C  0.01604 -1.125006 0.537297
C  -0.772586 -1.271101 1.694028
C  -0.528759 0.078409 -1.720785
C  1.346015 -1.725077 0.365579
C  3.573093 -1.630575 -0.627703
C  2.282293 0.424098 -0.329345
C  4.590705 -1.531085 0.495962
C  1.905591 1.203232 0.747778
C  2.673744 1.131614 -1.470939
C  1.915028 2.579519 0.570285
H  -2.809948 1.03958 -1.082741
H  -4.500581 -0.388452 0.988479
H  -3.792714 2.704464 0.439023
H  -3.313178 1.74487 1.845042
H  -2.089975 2.492735 0.814747
H  -5.705694 1.600475 0.151871
H  -6.394992 0.163569 -0.576967
H  -5.310213 1.180073 -1.515189
H  -3.390739 -1.993119 -0.555594
H  -3.965955 -1.06992 -1.947923
H  -5.108537 -1.898458 -0.900668
H  -0.529646 -1.816102 2.592873
H  -1.389581 -0.147029 -2.351187
H  -0.32805 1.148779 -1.798953
H  0.321568 -0.450524 -2.142778
H  3.362324 -2.672404 -0.858086
H  3.971494 -1.180689 -1.537626
H  4.816599 -0.492895 0.74255
H  4.22968 -2.031424 1.392652
H  5.524021 -2.008988 0.197724
H  1.606143 0.773767 1.693351
H  2.993375 0.611457 -2.366611
H  1.619895 3.239889 1.376274
totalener: -972.58830122 hartree
nucrepener: 1895.76994914 hartree
electener: -2868.35825036 hartree
oneelecener: -5084.76918302 hartree
twoeener: 2216.41093267 hartree
kineticenergy: 968.35145941 hartree
xcener: -95.349818682503 hartree
chargesum: 0.0000000
charge: -0.368075 0.234598 -0.310139 -0.077119 -0.105502 -0.146779 -0.036717 0.065488 -0.279148 -0.109783 -0.278588 -0.287004 -0.021402 -0.111035 -0.298975 0.336070 -0.037766 0.025909 -0.248115 -0.090833 -0.092607 -0.029278 0.080397 0.058313 0.091449 0.109125 0.090132 0.092307 0.086837 0.080994 0.104505 0.068878 0.092131 0.140816 0.118794 0.124530 0.103503 0.097030 0.087391 0.082863 0.101462 0.090571 0.124146 0.114019 0.126610
qa: -0.3681 0.2346 -0.3101 -0.0771 -0.1055 -0.1468 -0.0367 0.0655 -0.2791 -0.1098 -0.2786 -0.2870 -0.0214 -0.1110 -0.2990 0.3361 -0.0378 0.0259 -0.2481 -0.0908 -0.0926 -0.0293 0.0804 0.0583 0.0914 0.1091 0.0901 0.0923 0.0868 0.0810 0.1045 0.0689 0.0921 0.1408 0.1188 0.1245 0.1035 0.0970 0.0874 0.0829 0.1015 0.0906 0.1241 0.1140 0.1266
va: 2.1365 3.2362 2.8584 2.9842 3.0103 2.9567 3.9392 3.7802 3.9599 3.9020 3.9433 3.9407 3.3777 4.1539 3.9726 4.1164 3.8724 3.7599 3.8955 3.8937 4.1529 4.0849 1.0055 1.0320 1.0044 1.0077 1.0108 1.0045 1.0091 1.0009 1.0069 1.0062 1.0095 1.0131 1.0008 0.9870 1.0132 1.0179 1.0014 1.0017 1.0140 1.0103 1.0175 1.0193 1.0074
dispcorr: -0.025126888 hartree
energy: -972.613428105823
dipole: -19.46088 18.87751 -0.58338 -0.15200 0.13637 -0.01564 -4.43057 4.08946 -0.34111
magnitude: 0.67596 au
magnitude: 1.71816 debye
