program: Orca
programVersion: 5.0.2
elementType: O N N N N N C C C C C C C C C C C C C C C C H H H H H H H H H H H H H H H H H H H H H H H
charge: 0
multiplicity: 1
keywords: wb97x-d3
keywords: def2-TZVPP
keywords: def2/J RIJCOSX
keywords: DEFGRID2
keywords: scfconv7
keywords: smallprint printgap noloewdin
keywords: NOSOSCF
formula: C16H23N5O
InChI: InChI=1/C16H23N5O/c1-6-20(14-7-8-17-18-9-14)16(22)15-10-19-21(13(15)5)12(4)11(2)3/h7-12H,6H2,1-5H3
45 atoms
O  1.904657 -2.67228 -1.158179
N  -2.000206 -0.690615 -0.362296
N  -1.931605 -1.03122 -1.650098
N  2.290439 -0.977933 0.294325
N  2.190018 2.193472 2.125131
N  1.702768 3.033334 1.244345
C  -3.256079 -0.161192 0.149286
C  -3.592106 1.167664 -0.54736
C  -4.344426 -1.218888 0.026011
C  -0.832177 -0.846542 0.289291
C  -4.853692 1.786891 0.045948
C  -2.429142 2.150741 -0.456996
C  0.06237 -1.320543 -0.658895
C  -0.698616 -1.431297 -1.838439
C  -0.671893 -0.592479 1.745725
C  1.472037 -1.717699 -0.552254
C  3.633637 -1.500199 0.557572
C  2.072276 0.379305 0.556395
C  4.662479 -1.031873 -0.45624
C  1.585119 1.27498 -0.376459
C  2.369981 0.926547 1.809572
C  1.4134 2.5896 0.033554
H  -3.088037 0.051781 1.208703
H  -3.77518 0.946477 -1.603448
H  -4.021846 -2.15659 0.478174
H  -5.253613 -0.904303 0.535131
H  -4.582263 -1.413458 -1.019062
H  -5.736882 1.167738 -0.107191
H  -5.057048 2.753014 -0.416486
H  -4.746156 1.958342 1.119928
H  -2.6942 3.099257 -0.925408
H  -1.536221 1.781301 -0.960817
H  -2.164498 2.366367 0.581449
H  -0.369372 -1.779227 -2.805104
H  0.246676 -1.045728 2.108066
H  -0.63056 0.473552 1.97732
H  -1.490141 -1.027029 2.320404
H  3.929055 -1.198232 1.562429
H  3.572856 -2.585789 0.562308
H  4.743141 0.055282 -0.473084
H  5.644964 -1.430556 -0.20326
H  4.408376 -1.377628 -1.456079
H  1.342453 0.979783 -1.38756
H  2.760504 0.308872 2.60988
H  1.028341 3.333293 -0.653125
totalener: -972.58831587 hartree
nucrepener: 1912.93515226 hartree
electener: -2885.52346813 hartree
oneelecener: -5119.08861459 hartree
twoeener: 2233.56514646 hartree
kineticenergy: 968.35199137 hartree
xcener: -95.350861113869 hartree
chargesum: -0.0000000
charge: -0.368373 0.212835 -0.314398 -0.073220 -0.107841 -0.143139 -0.027516 0.065577 -0.274967 -0.080069 -0.278890 -0.288852 -0.043060 -0.091893 -0.290172 0.334763 -0.042368 0.024909 -0.248152 -0.107079 -0.083324 -0.035363 0.075189 0.056125 0.094162 0.089954 0.109473 0.092417 0.087250 0.081883 0.096166 0.080256 0.083723 0.138260 0.105847 0.119352 0.119649 0.088575 0.097796 0.084108 0.090635 0.101357 0.126448 0.113802 0.128167
qa: -0.3684 0.2128 -0.3144 -0.0732 -0.1078 -0.1431 -0.0275 0.0656 -0.2750 -0.0801 -0.2789 -0.2889 -0.0431 -0.0919 -0.2902 0.3348 -0.0424 0.0249 -0.2482 -0.1071 -0.0833 -0.0354 0.0752 0.0561 0.0942 0.0900 0.1095 0.0924 0.0872 0.0819 0.0962 0.0803 0.0837 0.1383 0.1058 0.1194 0.1196 0.0886 0.0978 0.0841 0.0906 0.1014 0.1264 0.1138 0.1282
va: 2.1365 3.2570 2.8634 2.9883 3.0108 2.9500 3.9388 3.7928 3.9553 3.8769 3.9459 3.9473 3.4004 4.1416 3.9726 4.1180 3.8749 3.7524 3.8954 3.8867 4.1397 4.0759 1.0089 1.0313 1.0103 1.0031 1.0088 1.0047 1.0091 1.0010 1.0108 1.0105 1.0048 1.0135 1.0127 0.9866 0.9996 1.0012 1.0185 1.0015 1.0101 1.0141 1.0162 1.0195 1.0060
dispcorr: -0.026137552 hartree
energy: -972.614453425346
dipole: -16.59863 15.97755 -0.62109 3.88231 -3.98293 -0.10061 2.02402 -1.69165 0.33237
magnitude: 0.71158 au
magnitude: 1.80869 debye
