program: Orca
programVersion: 5.0.2
elementType: O N N N N N C C C C C C C C C C C C C C C C H H H H H H H H H H H H H H H H H H H H H H H
charge: 0
multiplicity: 1
keywords: wb97x-d3
keywords: def2-TZVPP
keywords: def2/J RIJCOSX
keywords: DEFGRID2
keywords: scfconv7
keywords: smallprint printgap noloewdin
keywords: NOSOSCF
formula: C16H23N5O
InChI: InChI=1/C16H23N5O/c1-6-20(14-7-8-17-18-9-14)16(22)15-10-19-21(13(15)5)12(4)11(2)3/h7-12H,6H2,1-5H3
45 atoms
O  1.235254 -2.487564 0.754607
N  -2.058121 -0.06322 -0.236489
N  -1.599555 1.047642 0.346246
N  2.395313 -0.55041 0.748237
N  3.486832 2.910182 0.248179
N  3.122304 3.159829 -0.985809
C  -3.433636 -0.12678 -0.715493
C  -4.393921 -0.575348 0.404119
C  -3.814137 1.177578 -1.398359
C  -1.148781 -1.055556 -0.260038
C  -4.605038 0.475295 1.488239
C  -5.728498 -1.025987 -0.182073
C  -0.005219 -0.536191 0.330727
C  -0.364661 0.78153 0.686714
C  -1.424027 -2.391182 -0.853441
C  1.229691 -1.283188 0.599366
C  3.581711 -1.252461 1.24019
C  2.604019 0.684174 0.120371
C  4.384607 -1.913025 0.132114
C  2.237517 0.945824 -1.184659
C  3.241343 1.73303 0.78935
C  2.516221 2.211943 -1.679131
H  -3.441041 -0.91481 -1.473258
H  -3.930616 -1.451693 0.872257
H  -4.817064 1.102255 -1.815794
H  -3.78652 2.020759 -0.712847
H  -3.129924 1.394429 -2.217866
H  -3.665386 0.826556 1.911329
H  -5.203426 0.060013 2.299999
H  -5.142451 1.34393 1.104689
H  -6.361653 -1.452879 0.595817
H  -5.599649 -1.787685 -0.9535
H  -6.280288 -0.194193 -0.622814
H  0.224737 1.531162 1.191357
H  -1.695631 -2.314585 -1.907926
H  -0.550253 -3.028192 -0.769324
H  -2.243733 -2.895574 -0.33894
H  4.202004 -0.533861 1.776091
H  3.256538 -1.992721 1.967399
H  4.725596 -1.184163 -0.603888
H  5.268081 -2.397087 0.548817
H  3.79465 -2.672632 -0.376761
H  1.749376 0.20458 -1.80201
H  3.560671 1.623298 1.819347
H  2.247072 2.480258 -2.693031
totalener: -972.58884965 hartree
nucrepener: 1855.83734358 hartree
electener: -2828.42619323 hartree
oneelecener: -5005.26451691 hartree
twoeener: 2176.83832368 hartree
kineticenergy: 968.34659273 hartree
xcener: -95.350202714154 hartree
chargesum: -0.0000000
charge: -0.407578 0.191510 -0.330726 -0.074264 -0.107802 -0.145943 0.011812 0.031039 -0.285482 -0.049401 -0.272820 -0.276307 -0.131582 -0.038143 -0.250523 0.372436 -0.040583 -0.003088 -0.246755 -0.060121 -0.090567 -0.003401 0.079978 0.042920 0.089665 0.110326 0.097958 0.104079 0.088516 0.076425 0.092999 0.084515 0.080085 0.134006 0.095117 0.118289 0.101788 0.087667 0.094505 0.081410 0.089527 0.098695 0.119704 0.120309 0.119807
qa: -0.4076 0.1915 -0.3307 -0.0743 -0.1078 -0.1459 0.0118 0.0310 -0.2855 -0.0494 -0.2728 -0.2763 -0.1316 -0.0381 -0.2505 0.3724 -0.0406 -0.0031 -0.2468 -0.0601 -0.0906 -0.0034 0.0800 0.0429 0.0897 0.1103 0.0980 0.1041 0.0885 0.0764 0.0930 0.0845 0.0801 0.1340 0.0951 0.1183 0.1018 0.0877 0.0945 0.0814 0.0895 0.0987 0.1197 0.1203 0.1198
va: 2.0868 3.2848 2.8701 3.0620 3.0039 2.9653 3.8981 3.8719 3.9653 3.9511 3.9377 3.9309 3.4805 4.0604 3.9630 4.0789 3.8741 3.7889 3.8901 3.8816 4.1710 4.0886 0.9976 1.0164 1.0011 1.0075 1.0110 1.0210 1.0049 1.0018 1.0074 1.0052 1.0048 1.0040 0.9949 1.0277 0.9983 1.0009 1.0190 1.0033 1.0110 1.0138 1.0124 1.0144 1.0080
dispcorr: -0.023191458 hartree
energy: -972.612041107178
dipole: -25.55013 24.43944 -1.11069 -10.68874 9.30558 -1.38316 -2.46552 1.82209 -0.64343
magnitude: 1.88700 au
magnitude: 4.79636 debye
