program: Orca
programVersion: 5.0.2
elementType: O N N N N N C C C C C C C C C C C C C C C C H H H H H H H H H H H H H H H H H H H H H H H
charge: 0
multiplicity: 1
keywords: wb97x-d3
keywords: def2-TZVPP
keywords: def2/J RIJCOSX
keywords: DEFGRID2
keywords: scfconv7
keywords: smallprint printgap noloewdin
keywords: NOSOSCF
formula: C16H23N5O
InChI: InChI=1/C16H23N5O/c1-6-20(14-7-8-17-18-9-14)16(22)15-10-19-21(13(15)5)12(4)11(2)3/h7-12H,6H2,1-5H3
45 atoms
O  1.483803 -2.653958 0.742217
N  -2.038915 -0.628258 -0.407882
N  -1.462026 0.061231 -1.394694
N  2.50318 -0.736585 0.116544
N  1.555881 2.746875 0.759081
N  2.325335 3.415234 -0.069892
C  -3.478625 -0.540735 -0.196317
C  -3.826674 0.639089 0.733381
C  -4.209558 -0.537143 -1.529066
C  -1.150767 -1.287814 0.359532
C  -3.580991 2.006975 0.107023
C  -5.261353 0.520918 1.238833
C  0.097564 -0.982267 -0.160597
C  -0.176205 -0.137619 -1.257089
C  -1.543451 -2.138194 1.514371
C  1.380002 -1.5328 0.290679
C  3.812758 -1.385277 0.196685
C  2.452523 0.653092 0.00643
C  4.188378 -2.136268 -1.069658
C  3.275942 1.361008 -0.84568
C  1.60956 1.433954 0.81113
C  3.161621 2.74572 -0.839529
H  -3.752638 -1.45831 0.332303
H  -3.166628 0.546895 1.604208
H  -3.954932 -1.423767 -2.108533
H  -5.28585 -0.548701 -1.362992
H  -3.96127 0.334176 -2.129927
H  -2.564325 2.116845 -0.266209
H  -3.7486 2.791102 0.846081
H  -4.263238 2.194932 -0.723409
H  -5.460485 1.275868 1.999635
H  -5.457353 -0.455054 1.687594
H  -5.988173 0.672467 0.439417
H  0.515231 0.306315 -1.956408
H  -2.140436 -2.992582 1.190489
H  -0.661737 -2.534003 2.008196
H  -2.12999 -1.583878 2.248551
H  4.549382 -0.613679 0.419294
H  3.80541 -2.067588 1.046001
H  5.167501 -2.600742 -0.951456
H  3.471285 -2.926644 -1.284841
H  4.235761 -1.476119 -1.936292
H  3.976317 0.871938 -1.509636
H  0.952558 0.971681 1.536986
H  3.774587 3.351075 -1.495947
totalener: -972.58826025 hartree
nucrepener: 1872.09814238 hartree
electener: -2844.68640263 hartree
oneelecener: -5037.95812813 hartree
twoeener: 2193.27172550 hartree
kineticenergy: 968.34316052 hartree
xcener: -95.350180451247 hartree
chargesum: 0.0000000
charge: -0.392491 0.187559 -0.332553 -0.059245 -0.105702 -0.155660 0.022529 0.031236 -0.290945 -0.047583 -0.271149 -0.279116 -0.118184 -0.021049 -0.247417 0.316342 -0.065187 0.063207 -0.236677 -0.163618 -0.041074 -0.011107 0.083195 0.042183 0.101264 0.089495 0.108521 0.109173 0.089441 0.074627 0.093617 0.084855 0.080905 0.128407 0.102820 0.111597 0.099502 0.095577 0.103304 0.088683 0.101848 0.066771 0.133451 0.108109 0.120540
qa: -0.3925 0.1876 -0.3326 -0.0592 -0.1057 -0.1557 0.0225 0.0312 -0.2909 -0.0476 -0.2711 -0.2791 -0.1182 -0.0210 -0.2474 0.3163 -0.0652 0.0632 -0.2367 -0.1636 -0.0411 -0.0111 0.0832 0.0422 0.1013 0.0895 0.1085 0.1092 0.0894 0.0746 0.0936 0.0849 0.0809 0.1284 0.1028 0.1116 0.0995 0.0956 0.1033 0.0887 0.1018 0.0668 0.1335 0.1081 0.1205
va: 2.1045 3.2809 2.8807 3.0584 3.0000 2.9783 3.8923 3.8686 3.9692 3.9555 3.9412 3.9318 3.4540 4.0494 3.9664 4.1152 3.8479 3.7913 3.9188 3.9068 4.1168 4.1138 0.9959 1.0153 1.0109 1.0002 1.0077 1.0191 1.0050 1.0018 1.0076 1.0045 1.0040 1.0047 0.9976 1.0244 0.9942 0.9982 1.0221 1.0093 1.0068 1.0076 1.0046 1.0220 1.0076
dispcorr: -0.023530332 hartree
energy: -972.611790582402
dipole: -20.88774 20.81588 -0.07186 -5.25718 4.23554 -1.02165 0.38891 -0.55843 -0.16952
magnitude: 1.03811 au
magnitude: 2.63866 debye
