program: Orca
programVersion: 5.0.2
elementType: O O O O O O O C C C C C C C C C C C C C C C C C C C C C C C C C C C C C C C H H H H H H H H H H H H H H H H H H H H H H H H H H H H H H H H H H H H H H H H H H H H
charge: 0
multiplicity: 1
keywords: wb97x-d3
keywords: def2-TZVPP
keywords: def2/J RIJCOSX
keywords: DEFGRID2
keywords: scfconv7
keywords: smallprint printgap noloewdin
keywords: NOSOSCF
formula: C31H44O7
InChI: InChI=1/C31H44O7/c1-18-7-6-8-23-17-35-28-27(32)21(4)14-26(31(23,28)34)29(33)36-25-15-24(10-9-19(2)13-18)38-30(16-25)12-11-20(3)22(5)37-30/h6-9,14,18,20,22,24-28,32,34H,10-13,15-17H2,1-5H3
82 atoms
O  3.493457 -0.205034 1.022828
O  3.521476 -1.718815 -0.729384
O  -0.51336 -0.926921 0.358716
O  -5.174138 0.573214 0.634002
O  -3.212913 -0.695394 -1.974429
O  -5.161054 -1.785057 1.874414
O  -0.799779 -2.54575 -1.160726
C  3.20875 -1.521957 0.622898
C  1.716047 -1.828559 0.760272
C  -3.426512 -0.521433 -0.603088
C  0.877764 -0.776084 0.051336
C  4.055327 -2.429452 1.507013
C  5.800455 -2.461367 -0.305399
C  -4.936094 -0.53952 -0.210132
C  5.534951 -2.277644 1.187679
C  1.275049 0.607459 0.526274
C  2.77167 0.810165 0.351516
C  -2.698529 -1.711768 0.074748
C  4.879075 -1.540126 -1.106634
C  -5.435524 -1.818121 0.494041
C  -3.011462 0.842029 -0.10729
C  -3.448054 -2.966631 -0.273681
C  -1.243469 -1.793881 -0.339692
C  -4.760608 -3.029955 -0.089353
C  -3.951663 1.191844 0.995142
C  3.248171 2.146007 0.917309
C  7.268868 -2.215108 -0.626279
C  4.92777 -1.783479 -2.602713
C  -2.085678 1.615451 -0.676405
C  -5.592892 -4.232308 -0.389079
C  2.612124 3.294591 0.201071
C  1.689329 4.142334 0.659648
C  -1.727287 2.954956 -0.252712
C  1.113422 5.197341 -0.244273
C  -0.409609 5.084767 -0.43507
C  -0.794542 3.7005 -0.851769
C  1.125794 4.112928 2.048666
C  -0.890916 6.111674 -1.461074
H  1.460818 -1.833907 1.824342
H  1.513261 -2.823203 0.361292
H  1.019511 -0.860895 -1.029463
H  3.742399 -3.462782 1.33102
H  3.855689 -2.208693 2.557524
H  -5.524533 -0.41654 -1.128032
H  5.550221 -3.496055 -0.574746
H  5.884842 -1.290054 1.502754
H  6.11547 -3.007082 1.758411
H  0.729875 1.375254 -0.023949
H  1.012274 0.725391 1.583478
H  3.005024 0.790008 -0.723842
H  -2.730615 -1.553691 1.156948
H  5.187727 -0.501565 -0.909172
H  -6.5215 -1.884351 0.326477
H  -2.895593 -3.802878 -0.682905
H  -4.122095 2.264661 1.102013
H  -3.589019 0.815864 1.963047
H  3.04686 2.169255 1.990009
H  4.335097 2.197669 0.800921
H  7.517664 -2.460733 -1.658446
H  7.539244 -1.170074 -0.457454
H  7.909931 -2.823389 0.013331
H  4.689179 -2.821329 -2.839995
H  4.208967 -1.146851 -3.11877
H  5.91451 -1.559351 -3.005719
H  -3.590008 0.057853 -2.439119
H  -1.532905 1.216158 -1.522587
H  -6.369611 -4.005838 -1.123783
H  -6.101478 -4.589636 0.509318
H  -4.990675 -5.049906 -0.782945
H  2.927568 3.415593 -0.833163
H  -5.53946 -0.968055 2.215443
H  -2.241123 3.36969 0.610123
H  1.597995 5.148382 -1.22431
H  1.332442 6.193513 0.157641
H  -0.900692 5.306131 0.518695
H  -0.267146 3.294773 -1.713955
H  1.063918 5.12081 2.46502
H  1.713146 3.508487 2.736009
H  0.111549 3.705353 2.046408
H  -0.463319 5.914704 -2.446023
H  -1.975791 6.09045 -1.56035
H  -0.597936 7.122041 -1.170682
totalener: -1734.51629788 hartree
nucrepener: 4659.41052894 hartree
electener: -6393.92682682 hartree
twoeener: 5243.34986783 hartree
kineticenergy: 1726.75902666 hartree
xcener: -168.567614698668 hartree
chargesum: 0.0000000
charge: -0.359300 -0.343648 -0.259748 -0.358810 -0.315714 -0.343344 -0.347949 0.531100 -0.269207 0.531319 0.176608 -0.210210 0.086198 -0.003011 -0.176071 -0.159312 0.133459 0.083031 0.071247 0.186399 -0.241114 -0.188939 0.229453 -0.094661 -0.023768 -0.140906 -0.317514 -0.285496 -0.106055 -0.240175 -0.159127 -0.007576 -0.127212 -0.162831 0.073104 -0.138343 -0.276750 -0.265030 0.083829 0.104719 0.090411 0.078423 0.081656 0.083588 0.038842 0.079640 0.074425 0.040650 0.077204 0.066982 0.101431 0.053186 0.075534 0.108098 0.080937 0.092848 0.079927 0.087907 0.089672 0.081492 0.084746 0.087145 0.093426 0.078140 0.166008 0.111616 0.084001 0.102061 0.082333 0.081621 0.180676 0.066884 0.073863 0.091035 0.041085 0.097075 0.100316 0.094726 0.090608 0.081401 0.094858 0.084875
qa: -0.3593 -0.3436 -0.2597 -0.3588 -0.3157 -0.3433 -0.3479 0.5311 -0.2692 0.5313 0.1766 -0.2102 0.0862 -0.0030 -0.1761 -0.1593 0.1335 0.0830 0.0712 0.1864 -0.2411 -0.1889 0.2295 -0.0947 -0.0238 -0.1409 -0.3175 -0.2855 -0.1061 -0.2402 -0.1591 -0.0076 -0.1272 -0.1628 0.0731 -0.1383 -0.2767 -0.2650 0.0838 0.1047 0.0904 0.0784 0.0817 0.0836 0.0388 0.0796 0.0744 0.0407 0.0772 0.0670 0.1014 0.0532 0.0755 0.1081 0.0809 0.0928 0.0799 0.0879 0.0897 0.0815 0.0847 0.0871 0.0934 0.0781 0.1660 0.1116 0.0840 0.1021 0.0823 0.0816 0.1807 0.0669 0.0739 0.0910 0.0411 0.0971 0.1003 0.0947 0.0906 0.0814 0.0949 0.0849
va: 2.0571 2.0706 2.1670 2.0024 2.1359 2.1130 2.1535 3.8024 3.8832 3.7194 3.8301 3.9324 3.7799 4.1934 3.9329 3.9098 3.9286 3.7982 3.9612 4.0697 3.6548 3.9262 4.3255 3.6792 4.0673 3.9291 3.9720 3.9649 3.8783 3.9316 3.8257 3.6822 4.0125 3.8836 3.8462 3.9189 3.9422 3.9268 1.0210 1.0442 1.0387 1.0159 1.0275 1.0184 1.0226 1.0219 1.0152 1.0572 1.0275 1.0082 1.0591 1.0017 0.9844 1.0391 0.9997 0.9842 1.0287 1.0197 1.0031 1.0030 1.0068 1.0084 1.0107 1.0042 1.0622 1.0328 0.9969 0.9956 1.0102 1.0186 1.0575 1.0272 1.0184 1.0066 1.0211 1.0189 1.0020 1.0150 0.9968 1.0063 1.0092 1.0057
dispcorr: -0.052581166 hartree
energy: -1734.568879050139
dipole: 30.86191 -30.68218 0.17973 14.97892 -13.45995 1.51897 -1.10168 1.32338 0.22170
magnitude: 1.54555 au
magnitude: 3.92848 debye
