program: Orca
programVersion: 5.0.2
elementType: O O O N C C C C C C C C C C C C C C C C C C C C H H H H H H H H H H H H H H H H H H H
charge: 0
multiplicity: 1
keywords: wb97x-d3
keywords: def2-TZVPP
keywords: def2/J RIJCOSX
keywords: DEFGRID2
keywords: scfconv7
keywords: smallprint printgap noloewdin
keywords: NOSOSCF
formula: C20H19NO3
InChI: InChI=1/C20H19NO3/c1-16(23-20-9-5-6-14-21-20)15-22-17-10-12-19(13-11-17)24-18-7-3-2-4-8-18/h2-14,16H,15H2,1H3
43 atoms
O  2.400208 1.455849 0.364049
O  4.01895 -0.714256 -0.298379
O  -2.852879 -0.197715 0.464919
N  2.050668 -1.893771 -0.085308
C  3.503465 0.093714 -1.361649
C  3.19507 1.48018 -0.808237
C  4.558144 0.182294 -2.442667
C  1.095626 1.088082 0.299152
C  0.365769 0.962951 -0.87815
C  0.47911 0.816813 1.517556
C  -1.562972 0.277432 0.3820
C  3.1717 -1.453202 0.443907
C  -0.956494 0.544775 -0.834887
C  -0.847037 0.423995 1.560477
C  -3.860341 0.443478 -0.204892
C  3.573611 -1.752013 1.747237
C  -3.838991 1.805089 -0.482886
C  -4.955223 -0.332366 -0.56553
C  2.731933 -2.525744 2.518345
C  1.236702 -2.618939 0.680054
C  1.521486 -2.961776 1.985291
C  -4.918129 2.379071 -1.14089
C  -6.030412 0.258462 -1.21152
C  -6.015774 1.614387 -1.510039
H  2.606684 -0.36956 -1.773051
H  4.123194 1.968368 -0.506682
H  2.745823 2.096473 -1.5933
H  4.203336 0.817145 -3.254485
H  5.489111 0.607385 -2.065148
H  4.769637 -0.800947 -2.861813
H  0.807517 1.16326 -1.844618
H  1.043675 0.910034 2.436695
H  -1.502404 0.428058 -1.762691
H  -1.318806 0.216085 2.512267
H  4.513251 -1.379997 2.132705
H  -2.997322 2.420634 -0.193797
H  -4.96286 -1.391071 -0.339979
H  3.008101 -2.776521 3.53373
H  0.311668 -2.942643 0.217213
H  0.82674 -3.553421 2.564008
H  -4.896267 3.438246 -1.360737
H  -6.880266 -0.350476 -1.490179
H  -6.851505 2.070298 -2.023208
elementType: O N C H
totalener: -1054.06484068 hartree
nucrepener: 1977.91772933 hartree
electener: -3031.98257001 hartree
oneelecener: -5363.66157870 hartree
twoeener: 2331.67900869 hartree
cpcmener: -0.03001642 hartree
kineticenergy: 1049.49065436 hartree
xcener: -102.367119223923 hartree
chargesum: 0.0000000
charge: -0.350660 -0.349928 -0.347814 -0.356680 0.164883 -0.005939 -0.280577 0.290054 -0.164834 -0.227722 0.246816 0.366667 -0.204514 -0.220911 0.303972 -0.248081 -0.196773 -0.262467 -0.084853 -0.008172 -0.190925 -0.157157 -0.123689 -0.196236 0.090755 0.120018 0.111378 0.097920 0.093157 0.100051 0.148678 0.139443 0.159743 0.145829 0.144277 0.156177 0.146498 0.165651 0.144134 0.158130 0.162414 0.160773 0.160515
qa: -0.3507 -0.3499 -0.3478 -0.3567 0.1649 -0.0059 -0.2806 0.2901 -0.1648 -0.2277 0.2468 0.3667 -0.2045 -0.2209 0.3040 -0.2481 -0.1968 -0.2625 -0.0849 -0.0082 -0.1909 -0.1572 -0.1237 -0.1962 0.0908 0.1200 0.1114 0.0979 0.0932 0.1001 0.1487 0.1394 0.1597 0.1458 0.1443 0.1562 0.1465 0.1657 0.1441 0.1581 0.1624 0.1608 0.1605
va: 2.0413 2.0498 2.0450 2.9700 3.7141 3.8990 3.9680 3.7136 3.8047 3.9326 3.6716 3.9757 3.9602 4.0083 3.6738 3.9488 3.8814 3.9997 3.8791 4.0011 3.8441 3.8947 3.8835 3.8990 1.0328 1.0006 0.9967 1.0042 1.0069 1.0056 0.9998 1.0099 0.9949 1.0048 1.0076 0.9988 1.0090 0.9865 0.9953 0.9928 0.9895 0.9880 0.9897
dispcorr: -0.022037257 hartree
energy: -1054.086877935887
dipole: 4.78378 -4.50994 0.27384 2.77178 -2.30804 0.46373 -6.96150 6.44895 -0.51255
magnitude: 0.74347 au
magnitude: 1.88974 debye
