program: Orca
programVersion: 5.0.2
elementType: O O O N C C C C C C C C C C C C C C C C C C C C H H H H H H H H H H H H H H H H H H H
charge: 0
multiplicity: 1
keywords: wb97x-d3
keywords: def2-TZVPP
keywords: def2/J RIJCOSX
keywords: DEFGRID2
keywords: scfconv7
keywords: smallprint printgap noloewdin
keywords: NOSOSCF
formula: C20H19NO3
InChI: InChI=1/C20H19NO3/c1-16(23-20-9-5-6-14-21-20)15-22-17-10-12-19(13-11-17)24-18-7-3-2-4-8-18/h2-14,16H,15H2,1H3
43 atoms
O  2.217711 1.298377 1.070759
O  4.118476 -0.575661 0.261775
O  -2.604933 0.173353 -1.34647
N  2.344997 -1.715209 -0.66468
C  3.917181 0.590632 -0.547186
C  3.366533 1.696598 0.341148
C  5.250139 0.9947 -1.136645
C  1.046242 1.072385 0.422935
C  0.112265 0.296825 1.10837
C  0.734652 1.560241 -0.840064
C  -1.41857 0.497975 -0.724336
C  3.127191 -1.48367 0.367599
C  -1.112986 0.006397 0.538803
C  -0.503537 1.277292 -1.406242
C  -3.7856 0.478455 -0.722492
C  3.022308 -2.168415 1.579857
C  -4.878698 -0.320451 -1.033918
C  -3.92142 1.551455 0.150219
C  2.033526 -3.12366 1.696703
C  1.383173 -2.626889 -0.530253
C  1.181713 -3.360235 0.621371
C  -6.113478 -0.042335 -0.466879
C  -5.162701 1.811566 0.715866
C  -6.262491 1.020315 0.414603
H  3.221858 0.361145 -1.356021
H  4.104294 1.962383 1.099839
H  3.181588 2.594152 -0.256533
H  5.13062 1.893027 -1.742469
H  5.98662 1.207878 -0.360485
H  5.643277 0.210598 -1.782699
H  0.356041 -0.096833 2.087121
H  1.432391 2.164537 -1.403873
H  -1.819504 -0.611917 1.07822
H  -0.741021 1.662365 -2.389688
H  3.692327 -1.948398 2.39986
H  -4.762693 -1.153202 -1.716056
H  -3.079524 2.187283 0.391546
H  1.916914 -3.671675 2.622355
H  0.747152 -2.781786 -1.393872
H  0.387731 -4.091143 0.677825
H  -6.961059 -0.668792 -0.712083
H  -5.265379 2.647192 1.395858
H  -7.225494 1.229853 0.860357
elementType: O N C H
totalener: -1054.06521585 hartree
nucrepener: 1977.52471555 hartree
electener: -3031.58993140 hartree
oneelecener: -5362.86719632 hartree
twoeener: 2331.27726492 hartree
cpcmener: -0.03058279 hartree
kineticenergy: 1049.47654679 hartree
xcener: -102.362773300682 hartree
chargesum: -0.0000000
charge: -0.351534 -0.353498 -0.350000 -0.357307 0.167007 -0.005792 -0.282996 0.293032 -0.250466 -0.169562 0.229172 0.364163 -0.156184 -0.232651 0.281034 -0.246830 -0.248755 -0.180621 -0.085483 -0.002815 -0.188794 -0.128462 -0.164663 -0.192745 0.089350 0.119799 0.111024 0.097824 0.093514 0.099939 0.143700 0.149809 0.158881 0.149787 0.144846 0.146965 0.156042 0.165730 0.144370 0.158627 0.160928 0.162110 0.161505
qa: -0.3515 -0.3535 -0.3500 -0.3573 0.1670 -0.0058 -0.2830 0.2930 -0.2505 -0.1696 0.2292 0.3642 -0.1562 -0.2327 0.2810 -0.2468 -0.2488 -0.1806 -0.0855 -0.0028 -0.1888 -0.1285 -0.1647 -0.1927 0.0893 0.1198 0.1110 0.0978 0.0935 0.0999 0.1437 0.1498 0.1589 0.1498 0.1448 0.1470 0.1560 0.1657 0.1444 0.1586 0.1609 0.1621 0.1615
va: 2.0385 2.0434 2.0389 2.9762 3.7216 3.8912 3.9742 3.7256 3.9438 3.8110 3.7002 3.9827 3.9251 4.0413 3.6858 3.9481 3.9909 3.8669 3.8717 3.9994 3.8393 3.8904 3.9024 3.8941 1.0340 1.0026 0.9959 1.0039 1.0065 1.0059 1.0076 0.9988 0.9946 1.0052 1.0073 1.0086 0.9991 0.9866 0.9966 0.9923 0.9879 0.9898 0.9892
dispcorr: -0.022120713 hartree
energy: -1054.087336560939
dipole: 5.50012 -5.34067 0.15946 3.45523 -3.06631 0.38891 -0.28245 0.71193 0.42948
magnitude: 0.60094 au
magnitude: 1.52748 debye
