program: Orca
programVersion: 5.0.2
elementType: O O O N C C C C C C C C C C C C C C C C C C C C H H H H H H H H H H H H H H H H H H H
charge: 0
multiplicity: 1
keywords: wb97x-d3
keywords: def2-TZVPP
keywords: def2/J RIJCOSX
keywords: DEFGRID2
keywords: scfconv7
keywords: smallprint printgap noloewdin
keywords: NOSOSCF
formula: C20H19NO3
InChI: InChI=1/C20H19NO3/c1-16(23-20-9-5-6-14-21-20)15-22-17-10-12-19(13-11-17)24-18-7-3-2-4-8-18/h2-14,16H,15H2,1H3
43 atoms
O  1.268677 0.306958 0.056102
O  3.251311 -1.614339 0.295983
O  -3.637242 2.802776 0.17476
N  5.22472 -2.526776 -0.46598
C  3.176824 -0.779628 -0.86498
C  1.71647 -0.438934 -1.059541
C  4.05693 0.44785 -0.716019
C  0.035237 0.860656 0.021096
C  -0.864482 0.710406 -1.030113
C  -0.326429 1.631788 1.125132
C  -2.451562 2.105869 0.117455
C  4.315785 -2.409474 0.478618
C  -2.101567 1.341004 -0.982503
C  -1.565426 2.244071 1.177042
C  -4.814723 2.169032 -0.121694
C  4.380102 -3.093626 1.697642
C  -5.815621 2.947941 -0.689263
C  -5.041805 0.828585 0.167899
C  5.455508 -3.927138 1.910888
C  6.259712 -3.338306 -0.241028
C  6.428008 -4.059324 0.920942
C  -7.050819 2.380819 -0.965417
C  -6.28026 0.273368 -0.12307
C  -7.288866 1.040774 -0.690062
H  3.480468 -1.343841 -1.750176
H  1.628827 0.140033 -1.984064
H  1.122844 -1.351965 -1.17955
H  5.108366 0.174534 -0.658286
H  3.933691 1.095321 -1.58383
H  3.808149 1.023589 0.174611
H  -0.624797 0.116098 -1.901052
H  0.368741 1.749175 1.946905
H  -2.782826 1.227853 -1.81638
H  -1.837352 2.841657 2.037948
H  3.605373 -2.963504 2.441218
H  -5.626525 3.991358 -0.908613
H  -4.2695 0.218495 0.61862
H  5.54113 -4.471297 2.842133
H  6.989562 -3.405954 -1.038951
H  7.287465 -4.700974 1.052021
H  -7.827505 2.992021 -1.406365
H  -6.45531 -0.770326 0.103041
H  -8.251118 0.599705 -0.912767
elementType: O N C H
totalener: -1054.06786605 hartree
nucrepener: 1813.02051167 hartree
electener: -2867.08837772 hartree
oneelecener: -5033.35171933 hartree
twoeener: 2166.26334161 hartree
cpcmener: -0.02903517 hartree
kineticenergy: 1049.46894386 hartree
xcener: -102.359766109264 hartree
chargesum: -0.0000000
charge: -0.340368 -0.335719 -0.348214 -0.411260 0.166162 0.026573 -0.298856 0.302460 -0.188484 -0.227858 0.229498 0.427676 -0.212912 -0.203874 0.285947 -0.258241 -0.251452 -0.188763 -0.089742 -0.001733 -0.197850 -0.128143 -0.156892 -0.193406 0.069704 0.112106 0.119468 0.098578 0.101404 0.092824 0.144586 0.143567 0.160753 0.148712 0.146724 0.146712 0.157919 0.165802 0.141718 0.160173 0.161131 0.162011 0.161561
qa: -0.3404 -0.3357 -0.3482 -0.4113 0.1662 0.0266 -0.2989 0.3025 -0.1885 -0.2279 0.2295 0.4277 -0.2129 -0.2039 0.2859 -0.2582 -0.2515 -0.1888 -0.0897 -0.0017 -0.1978 -0.1281 -0.1569 -0.1934 0.0697 0.1121 0.1195 0.0986 0.1014 0.0928 0.1446 0.1436 0.1608 0.1487 0.1467 0.1467 0.1579 0.1658 0.1417 0.1602 0.1611 0.1620 0.1616
va: 2.0640 2.1084 2.0446 2.9723 3.8487 3.8339 3.9259 3.7768 3.8669 3.9904 3.7245 3.8860 3.9839 4.0166 3.6841 3.9496 3.9954 3.8846 3.8836 4.0419 3.8620 3.8863 3.8970 3.8964 1.0347 0.9905 0.9996 1.0157 1.0064 1.0143 1.0092 1.0078 0.9950 1.0036 1.0061 1.0083 0.9975 0.9871 0.9950 0.9916 0.9880 0.9896 0.9893
dispcorr: -0.017172430 hartree
energy: -1054.085038475715
dipole: 4.96801 -4.52170 0.44631 -2.48253 1.39808 -1.08444 -3.65043 3.14783 -0.50260
magnitude: 1.27586 au
magnitude: 3.24298 debye
