program: Orca
programVersion: 5.0.2
elementType: O O O N C C C C C C C C C C C C C C C C C C C C H H H H H H H H H H H H H H H H H H H
charge: 0
multiplicity: 1
keywords: wb97x-d3
keywords: def2-TZVPP
keywords: def2/J RIJCOSX
keywords: DEFGRID2
keywords: scfconv7
keywords: smallprint printgap noloewdin
keywords: NOSOSCF
formula: C20H19NO3
InChI: InChI=1/C20H19NO3/c1-16(23-20-9-5-6-14-21-20)15-22-17-10-12-19(13-11-17)24-18-7-3-2-4-8-18/h2-14,16H,15H2,1H3
43 atoms
O  1.390709 0.530832 0.143097
O  3.202098 -1.57012 0.140072
O  -3.610271 2.818375 0.382114
N  5.156055 -2.506411 -0.641629
C  3.332381 -0.487322 -0.787854
C  1.931139 0.011563 -1.057693
C  4.259895 0.585714 -0.248323
C  0.147377 1.060103 0.124655
C  -0.324802 1.565727 1.33519
C  -0.662365 1.125027 -1.006381
C  -2.386609 2.192615 0.284461
C  4.145263 -2.52077 0.200383
C  -1.588578 2.122209 1.417063
C  -1.925192 1.697282 -0.922966
C  -4.746761 2.136443 0.040054
C  3.973932 -3.503778 1.182216
C  -4.842384 0.750114 0.073631
C  -5.846493 2.910574 -0.312617
C  4.918387 -4.502404 1.2631
C  6.06226 -3.48192 -0.547096
C  5.996063 -4.499998 0.378842
C  -6.048908 0.146432 -0.256526
C  -7.045263 2.292443 -0.632729
C  -7.153375 0.907793 -0.611459
H  3.715514 -0.857295 -1.741834
H  1.984592 0.784769 -1.831469
H  1.309491 -0.804239 -1.442493
H  5.276559 0.210402 -0.143889
H  4.29138 1.427923 -0.940343
H  3.935407 0.957762 0.723098
H  0.303673 1.51958 2.215638
H  -0.33282 0.744054 -1.963079
H  -1.94711 2.513233 2.360734
H  -2.542456 1.750497 -1.811113
H  3.123361 -3.471575 1.84963
H  -3.995541 0.137832 0.354923
H  -5.760896 3.989745 -0.332375
H  4.819538 -5.280617 2.008349
H  6.883606 -3.434541 -1.252309
H  6.758663 -5.26481 0.412058
H  -6.119787 -0.93316 -0.232438
H  -7.897781 2.900298 -0.906298
H  -8.088032 0.428154 -0.868959
elementType: O N C H
totalener: -1054.06841169 hartree
nucrepener: 1816.29406787 hartree
electener: -2870.36247956 hartree
oneelecener: -5039.86524805 hartree
twoeener: 2169.50276849 hartree
cpcmener: -0.02902919 hartree
kineticenergy: 1049.46870591 hartree
xcener: -102.359331363677 hartree
chargesum: 0.0000000
charge: -0.338881 -0.335733 -0.347117 -0.411213 0.159033 0.033450 -0.296597 0.305634 -0.233900 -0.184876 0.219035 0.429369 -0.190176 -0.213317 0.292419 -0.257015 -0.190863 -0.251747 -0.090747 -0.004231 -0.196598 -0.164539 -0.127461 -0.195771 0.070086 0.114269 0.117367 0.097282 0.100791 0.092834 0.144076 0.145091 0.148065 0.160997 0.146955 0.155648 0.146583 0.165841 0.141798 0.159971 0.162393 0.160690 0.161105
qa: -0.3389 -0.3357 -0.3471 -0.4112 0.1590 0.0334 -0.2966 0.3056 -0.2339 -0.1849 0.2190 0.4294 -0.1902 -0.2133 0.2924 -0.2570 -0.1909 -0.2517 -0.0907 -0.0042 -0.1966 -0.1645 -0.1275 -0.1958 0.0701 0.1143 0.1174 0.0973 0.1008 0.0928 0.1441 0.1451 0.1481 0.1610 0.1470 0.1556 0.1466 0.1658 0.1418 0.1600 0.1624 0.1607 0.1611
va: 2.0668 2.1078 2.0449 2.9734 3.8612 3.8208 3.9307 3.7757 3.9874 3.8555 3.7268 3.8838 4.0148 4.0018 3.6829 3.9494 3.8733 3.9881 3.8852 4.0456 3.8616 3.9048 3.8902 3.8961 1.0357 0.9911 0.9997 1.0156 1.0061 1.0141 1.0076 1.0085 1.0030 0.9950 1.0059 0.9996 1.0087 0.9870 0.9950 0.9916 0.9896 0.9880 0.9894
dispcorr: -0.017169281 hartree
energy: -1054.085580973559
dipole: 5.40852 -4.88857 0.51995 -2.32305 1.24581 -1.07724 -3.15427 2.50623 -0.64804
magnitude: 1.36042 au
magnitude: 3.45791 debye
