program: Orca
programVersion: 5.0.2
elementType: O O O N C C C C C C C C C C C C C C C C C C C C H H H H H H H H H H H H H H H H H H H
charge: 0
multiplicity: 1
keywords: wb97x-d3
keywords: def2-TZVPP
keywords: def2/J RIJCOSX
keywords: DEFGRID2
keywords: scfconv7
keywords: smallprint printgap noloewdin
keywords: NOSOSCF
formula: C20H19NO3
InChI: InChI=1/C20H19NO3/c1-16(23-20-9-5-6-14-21-20)15-22-17-10-12-19(13-11-17)24-18-7-3-2-4-8-18/h2-14,16H,15H2,1H3
43 atoms
O  1.619964 0.673434 0.133357
O  4.181721 -0.528273 0.167081
O  -3.764265 1.167966 1.180304
N  3.935589 -2.633816 -0.738467
C  3.621823 0.07049 -1.006523
C  2.109145 -0.025519 -0.996711
C  4.132905 1.496363 -1.047714
C  0.282118 0.757008 0.313405
C  -0.152692 1.565461 1.362472
C  -0.658365 0.092304 -0.468802
C  -2.43611 1.045096 0.839696
C  4.318896 -1.859513 0.253969
C  -1.503729 1.715414 1.618766
C  -2.013727 0.230508 -0.197304
C  -4.69844 1.44987 0.220276
C  4.89268 -2.347242 1.433802
C  -5.994993 1.020123 0.477368
C  -4.410155 2.168419 -0.934147
C  5.062164 -3.708728 1.550566
C  4.107199 -3.950978 -0.60679
C  4.661528 -4.542197 0.507278
C  -7.005957 1.312947 -0.425131
C  -5.432036 2.44514 -1.832404
C  -6.730912 2.021926 -1.587124
H  3.963974 -0.46041 -1.897909
H  1.728611 0.416421 -1.924513
H  1.793188 -1.072155 -0.97319
H  3.704292 2.016235 -1.904279
H  3.875418 2.05688 -0.149181
H  5.216668 1.512983 -1.160418
H  0.57317 2.086154 1.974189
H  -0.362588 -0.546374 -1.28935
H  -1.831693 2.350663 2.431666
H  -2.729857 -0.306118 -0.806874
H  5.193049 -1.668725 2.220767
H  -6.20812 0.463185 1.381093
H  -3.406297 2.516791 -1.139252
H  5.503902 -4.122896 2.447272
H  3.777858 -4.556606 -1.442779
H  4.776603 -5.615141 0.561948
H  -8.013611 0.976362 -0.219091
H  -5.204313 3.003621 -2.730977
H  -7.520142 2.243049 -2.292904
elementType: O N C H
totalener: -1054.06802468 hartree
nucrepener: 1840.10357512 hartree
electener: -2894.17159980 hartree
oneelecener: -5087.56471486 hartree
twoeener: 2193.39311506 hartree
cpcmener: -0.02825660 hartree
kineticenergy: 1049.46793692 hartree
xcener: -102.359754932623 hartree
chargesum: 0.0000000
charge: -0.344752 -0.340426 -0.346681 -0.417852 0.211475 -0.014279 -0.289629 0.299125 -0.230202 -0.184369 0.239812 0.433773 -0.204861 -0.222565 0.305860 -0.259694 -0.260240 -0.202038 -0.089718 -0.009431 -0.197080 -0.123892 -0.155591 -0.197453 0.074683 0.127624 0.113206 0.094790 0.089640 0.101978 0.143876 0.143606 0.148036 0.160534 0.147284 0.146843 0.156526 0.165543 0.142499 0.160583 0.160371 0.162402 0.160685
qa: -0.3448 -0.3404 -0.3467 -0.4179 0.2115 -0.0143 -0.2896 0.2991 -0.2302 -0.1844 0.2398 0.4338 -0.2049 -0.2226 0.3059 -0.2597 -0.2602 -0.2020 -0.0897 -0.0094 -0.1971 -0.1239 -0.1556 -0.1975 0.0747 0.1276 0.1132 0.0948 0.0896 0.1020 0.1439 0.1436 0.1480 0.1605 0.1473 0.1468 0.1565 0.1655 0.1425 0.1606 0.1604 0.1624 0.1607
va: 2.0485 2.0986 2.0506 2.9669 3.7979 3.7651 3.9541 3.7801 3.9902 3.8646 3.7118 3.8717 4.0203 3.9904 3.6731 3.9500 3.9952 3.8881 3.8842 4.0505 3.8605 3.8836 3.8973 3.9008 1.0359 0.9927 1.0094 1.0044 1.0149 1.0066 1.0076 1.0094 1.0039 0.9950 1.0067 1.0087 0.9982 0.9873 0.9947 0.9916 0.9881 0.9894 0.9897
dispcorr: -0.017367478 hartree
energy: -1054.085392158445
dipole: 4.67669 -4.12193 0.55476 1.39046 -2.02984 -0.63937 -6.47247 5.55116 -0.92131
magnitude: 1.25115 au
magnitude: 3.18017 debye
