program: Orca
programVersion: 5.0.2
elementType: O O O N C C C C C C C C C C C C C C C C C C C C H H H H H H H H H H H H H H H H H H H
charge: 0
multiplicity: 1
keywords: wb97x-d3
keywords: def2-TZVPP
keywords: def2/J RIJCOSX
keywords: DEFGRID2
keywords: scfconv7
keywords: smallprint printgap noloewdin
keywords: NOSOSCF
formula: C20H19NO3
InChI: InChI=1/C20H19NO3/c1-16(23-20-9-5-6-14-21-20)15-22-17-10-12-19(13-11-17)24-18-7-3-2-4-8-18/h2-14,16H,15H2,1H3
43 atoms
O  1.172044 -0.087933 -0.284672
O  3.684509 -0.90147 0.489668
O  -3.658239 2.35319 0.731774
N  4.651382 -2.736446 -0.515218
C  3.484048 -0.284017 -0.78602
C  2.32289 0.668168 -0.615614
C  4.726212 0.466742 -1.22545
C  0.01037 0.569445 -0.065352
C  -1.07782 -0.215208 0.319307
C  -0.151424 1.943636 -0.19814
C  -2.461901 1.739058 0.430559
C  4.315747 -2.081262 0.575621
C  -2.305678 0.364843 0.570671
C  -1.393148 2.522344 0.04358
C  -4.790033 1.978565 0.058176
C  4.569929 -2.555211 1.867731
C  -4.766428 1.438226 -1.222038
C  -5.997994 2.201214 0.708325
C  5.206722 -3.769745 1.993011
C  5.26573 -3.912874 -0.373794
C  5.569602 -4.475524 0.846726
C  -5.965757 1.113356 -1.842335
C  -7.186611 1.878136 0.072206
C  -7.178314 1.327317 -1.202852
H  3.222066 -1.039905 -1.529507
H  2.543043 1.404957 0.165701
H  2.177571 1.209224 -1.556367
H  4.553503 0.942111 -2.191113
H  4.994533 1.243459 -0.507987
H  5.576241 -0.204318 -1.338371
H  -0.953111 -1.284832 0.429258
H  0.666001 2.585118 -0.495126
H  -3.137633 -0.255056 0.879393
H  -1.514672 3.592285 -0.06554
H  4.273689 -1.978158 2.73329
H  -3.831494 1.271567 -1.740918
H  -6.003854 2.624592 1.704651
H  5.423586 -4.167269 2.975776
H  5.531827 -4.421294 -1.292948
H  6.073637 -5.42958 0.90362
H  -5.944655 0.692069 -2.838789
H  -8.124547 2.052095 0.583033
H  -8.107414 1.070314 -1.693291
elementType: O N C H
totalener: -1054.06943917 hartree
nucrepener: 1817.20079478 hartree
electener: -2871.27023395 hartree
oneelecener: -5041.79722834 hartree
twoeener: 2170.52699438 hartree
cpcmener: -0.02966287 hartree
kineticenergy: 1049.47609056 hartree
xcener: -102.359914499596 hartree
chargesum: -0.0000000
charge: -0.334909 -0.334063 -0.348133 -0.408653 0.161375 0.049215 -0.294788 0.309205 -0.251620 -0.181821 0.224775 0.435567 -0.146139 -0.262225 0.286611 -0.270872 -0.189119 -0.248877 -0.086712 -0.001916 -0.201516 -0.163067 -0.128775 -0.194198 0.071350 0.108196 0.107312 0.102951 0.095840 0.095397 0.143019 0.143196 0.160353 0.148998 0.147120 0.156442 0.147146 0.166665 0.142350 0.160013 0.162380 0.160705 0.161223
qa: -0.3349 -0.3341 -0.3481 -0.4087 0.1614 0.0492 -0.2948 0.3092 -0.2516 -0.1818 0.2248 0.4356 -0.1461 -0.2622 0.2866 -0.2709 -0.1891 -0.2489 -0.0867 -0.0019 -0.2015 -0.1631 -0.1288 -0.1942 0.0714 0.1082 0.1073 0.1030 0.0958 0.0954 0.1430 0.1432 0.1604 0.1490 0.1471 0.1564 0.1471 0.1667 0.1423 0.1600 0.1624 0.1607 0.1612
va: 2.0627 2.0855 2.0424 2.9721 3.8185 3.8035 3.9549 3.7834 4.0048 3.8342 3.7255 3.8802 3.9532 4.0626 3.6835 3.9557 3.8730 3.9885 3.8805 4.0435 3.8641 3.9048 3.8919 3.8955 1.0435 0.9993 0.9939 1.0062 1.0053 1.0143 1.0103 1.0102 0.9926 1.0068 1.0065 0.9989 1.0085 0.9866 0.9949 0.9919 0.9896 0.9880 0.9894
dispcorr: -0.016990651 hartree
energy: -1054.086429825949
dipole: 7.11042 -6.15519 0.95522 0.22896 -0.37015 -0.14120 -4.69118 4.38954 -0.30164
magnitude: 1.01162 au
magnitude: 2.57133 debye
