program: Orca
programVersion: 5.0.2
elementType: O O O N C C C C C C C C C C C C C C C C C C C C H H H H H H H H H H H H H H H H H H H
charge: 0
multiplicity: 1
keywords: wb97x-d3
keywords: def2-TZVPP
keywords: def2/J RIJCOSX
keywords: DEFGRID2
keywords: scfconv7
keywords: smallprint printgap noloewdin
keywords: NOSOSCF
formula: C20H19NO3
InChI: InChI=1/C20H19NO3/c1-16(23-20-9-5-6-14-21-20)15-22-17-10-12-19(13-11-17)24-18-7-3-2-4-8-18/h2-14,16H,15H2,1H3
43 atoms
O  1.733879 0.756666 0.410324
O  3.885386 -1.0034 0.962153
O  -3.381085 2.142993 -1.093532
N  4.091026 -2.377024 -0.878169
C  4.026392 0.161464 0.141478
C  2.725113 0.484905 -0.563659
C  4.514311 1.27165 1.049853
C  0.488507 1.072912 -0.013385
C  -0.415304 1.482878 0.967586
C  0.071348 1.013425 -1.338549
C  -2.126005 1.749379 -0.691721
C  3.89956 -2.228211 0.415123
C  -1.711662 1.827041 0.633481
C  -1.238614 1.340226 -1.668966
C  -4.489277 1.739522 -0.398184
C  3.71436 -3.301229 1.294398
C  -5.578122 2.602321 -0.418402
C  -4.569897 0.516355 0.257376
C  3.735262 -4.573872 0.768676
C  4.108219 -3.617977 -1.369644
C  3.937776 -4.747744 -0.599629
C  -6.752419 2.238978 0.223697
C  -5.749113 0.171824 0.904706
C  -6.843163 1.02607 0.89391
H  4.769743 -0.016143 -0.638998
H  2.885935 1.355927 -1.208777
H  2.423982 -0.349413 -1.202726
H  3.839798 1.45162 1.88638
H  5.499302 1.035292 1.451094
H  4.603698 2.197775 0.482635
H  -0.092633 1.543987 1.999307
H  0.739218 0.711255 -2.132874
H  -2.389786 2.158819 1.409481
H  -1.557908 1.285108 -2.701872
H  3.561076 -3.126846 2.350833
H  -5.505054 3.549451 -0.938041
H  -3.731001 -0.167577 0.269319
H  3.595785 -5.42847 1.417374
H  4.266313 -3.701613 -2.438341
H  3.959204 -5.729719 -1.049839
H  -7.59809 2.91393 0.203093
H  -5.808325 -0.778884 1.418338
H  -7.757563 0.748674 1.4009
elementType: O N C H
totalener: -1054.06794986 hartree
nucrepener: 1844.80716245 hartree
electener: -2898.87511231 hartree
oneelecener: -5097.00978013 hartree
twoeener: 2198.13466782 hartree
cpcmener: -0.02797654 hartree
kineticenergy: 1049.47071205 hartree
xcener: -102.360426062987 hartree
chargesum: -0.0000000
charge: -0.344102 -0.340484 -0.345964 -0.417492 0.209328 -0.014947 -0.289650 0.297182 -0.242504 -0.168881 0.261889 0.432361 -0.169708 -0.284556 0.306093 -0.256799 -0.261155 -0.205452 -0.091842 -0.009066 -0.195114 -0.123738 -0.151125 -0.197754 0.075044 0.129136 0.111493 0.090081 0.102145 0.094592 0.144684 0.143514 0.159699 0.148128 0.146800 0.147147 0.157509 0.166287 0.141991 0.160261 0.160861 0.162695 0.161412
qa: -0.3441 -0.3405 -0.3460 -0.4175 0.2093 -0.0149 -0.2896 0.2972 -0.2425 -0.1689 0.2619 0.4324 -0.1697 -0.2846 0.3061 -0.2568 -0.2612 -0.2055 -0.0918 -0.0091 -0.1951 -0.1237 -0.1511 -0.1978 0.0750 0.1291 0.1115 0.0901 0.1021 0.0946 0.1447 0.1435 0.1597 0.1481 0.1468 0.1471 0.1575 0.1663 0.1420 0.1603 0.1609 0.1627 0.1614
va: 2.0482 2.0991 2.0494 2.9662 3.7989 3.7683 3.9541 3.7867 4.0012 3.8488 3.6945 3.8732 3.9463 4.0679 3.6664 3.9497 3.9984 3.8962 3.8854 4.0490 3.8601 3.8828 3.8930 3.9012 1.0353 0.9935 1.0089 1.0146 1.0068 1.0046 1.0088 1.0081 0.9933 1.0085 1.0068 1.0086 0.9976 0.9871 0.9949 0.9917 0.9880 0.9893 0.9895
dispcorr: -0.017381295 hartree
energy: -1054.085331158885
dipole: 5.42131 -4.90349 0.51782 -0.28013 -0.55117 -0.83130 1.85330 -1.91663 -0.06333
magnitude: 0.98143 au
magnitude: 2.49460 debye
