program: Orca
programVersion: 5.0.2
elementType: O O O N C C C C C C C C C C C C C C C C C C C C H H H H H H H H H H H H H H H H H H H
charge: 0
multiplicity: 1
keywords: wb97x-d3
keywords: def2-TZVPP
keywords: def2/J RIJCOSX
keywords: DEFGRID2
keywords: scfconv7
keywords: smallprint printgap noloewdin
keywords: NOSOSCF
formula: C20H19NO3
InChI: InChI=1/C20H19NO3/c1-16(23-20-9-5-6-14-21-20)15-22-17-10-12-19(13-11-17)24-18-7-3-2-4-8-18/h2-14,16H,15H2,1H3
43 atoms
O  2.243803 1.669812 0.468023
O  3.598213 -0.798075 0.139592
O  -3.226312 2.351874 0.548588
N  2.392278 -2.737348 -0.169832
C  2.93526 -0.179719 -0.969267
C  2.977177 1.310816 -0.689607
C  3.641813 -0.500209 -2.271199
C  0.892811 1.782737 0.400586
C  0.141104 1.676028 -0.766542
C  0.241933 2.047346 1.604149
C  -1.87328 2.111806 0.472943
C  3.356066 -2.081769 0.44086
C  -1.235981 1.851643 -0.728635
C  -1.132473 2.203476 1.642201
C  -4.105006 1.515696 -0.088147
C  4.168805 -2.650462 1.4281
C  -3.874156 0.153432 -0.240947
C  -5.287167 2.086452 -0.542538
C  3.937677 -3.963231 1.773915
C  2.183784 -4.009018 0.177681
C  2.918366 -4.670182 1.137837
C  -4.835819 -0.630261 -0.863719
C  -6.242186 1.288217 -1.154457
C  -6.019968 -0.071633 -1.325067
H  1.900622 -0.525555 -1.018883
H  4.005114 1.623145 -0.496799
H  2.639337 1.862207 -1.570967
H  4.662818 -0.115653 -2.276577
H  3.679691 -1.574032 -2.449361
H  3.104566 -0.048562 -3.105437
H  0.597969 1.467296 -1.72379
H  0.817787 2.1279 2.517427
H  -1.798851 1.781833 -1.650874
H  -1.626503 2.406229 2.583903
H  4.951518 -2.069884 1.897144
H  -2.960962 -0.301183 0.120863
H  -5.456216 3.148312 -0.415428
H  4.547201 -4.437661 2.53167
H  1.381384 -4.516472 -0.344374
H  2.707014 -5.701731 1.380345
H  -4.653772 -1.690312 -0.982902
H  -7.161202 1.737664 -1.507163
H  -6.763247 -0.690495 -1.809355
elementType: O N C H
totalener: -1054.06748249 hartree
nucrepener: 1879.98859387 hartree
electener: -2934.05607636 hartree
oneelecener: -5167.32547479 hartree
twoeener: 2233.26939843 hartree
cpcmener: -0.03008399 hartree
kineticenergy: 1049.46325926 hartree
xcener: -102.358917470343 hartree
chargesum: -0.0000000
charge: -0.350450 -0.337870 -0.348310 -0.410653 0.165163 0.023211 -0.294154 0.296120 -0.186459 -0.230324 0.236511 0.437523 -0.210965 -0.206825 0.292429 -0.267400 -0.192483 -0.254792 -0.088911 -0.004031 -0.197601 -0.155201 -0.125562 -0.194941 0.074418 0.125833 0.107961 0.098006 0.097005 0.103008 0.147323 0.141908 0.159856 0.148279 0.146566 0.157413 0.147234 0.166414 0.141129 0.159585 0.162233 0.160581 0.161222
qa: -0.3504 -0.3379 -0.3483 -0.4107 0.1652 0.0232 -0.2942 0.2961 -0.1865 -0.2303 0.2365 0.4375 -0.2110 -0.2068 0.2924 -0.2674 -0.1925 -0.2548 -0.0889 -0.0040 -0.1976 -0.1552 -0.1256 -0.1949 0.0744 0.1258 0.1080 0.0980 0.0970 0.1030 0.1473 0.1419 0.1599 0.1483 0.1466 0.1574 0.1472 0.1664 0.1411 0.1596 0.1622 0.1606 0.1612
va: 2.0503 2.0777 2.0478 2.9684 3.6913 3.8874 3.9710 3.7553 3.8348 4.0095 3.7204 3.8692 3.9654 4.0276 3.6803 3.9532 3.8875 3.9971 3.8829 4.0483 3.8594 3.8948 3.8843 3.8980 1.0485 1.0059 0.9980 1.0045 1.0110 1.0051 1.0047 1.0095 0.9954 1.0035 1.0070 0.9976 1.0082 0.9869 0.9945 0.9920 0.9895 0.9881 0.9895
dispcorr: -0.017993524 hartree
energy: -1054.085476018208
dipole: 4.71299 -4.02110 0.69189 -5.08306 4.06517 -1.01789 -7.84470 6.96370 -0.88100
magnitude: 1.51360 au
magnitude: 3.84726 debye
