program: Orca
programVersion: 5.0.2
elementType: O O O N C C C C C C C C C C C C C C C C C C C C H H H H H H H H H H H H H H H H H H H
charge: 0
multiplicity: 1
keywords: wb97x-d3
keywords: def2-TZVPP
keywords: def2/J RIJCOSX
keywords: DEFGRID2
keywords: scfconv7
keywords: smallprint printgap noloewdin
keywords: NOSOSCF
formula: C20H19NO3
InChI: InChI=1/C20H19NO3/c1-16(23-20-9-5-6-14-21-20)15-22-17-10-12-19(13-11-17)24-18-7-3-2-4-8-18/h2-14,16H,15H2,1H3
43 atoms
O  1.687006 1.325922 0.909338
O  3.694812 -0.601789 0.593379
O  -3.386137 0.353028 -1.013396
N  3.405763 -2.510738 -0.664943
C  3.330371 0.216346 -0.523112
C  2.81417 1.512967 0.073063
C  4.525045 0.486235 -1.416084
C  0.468546 1.089451 0.362692
C  -0.534498 0.716739 1.258725
C  0.163965 1.211888 -0.988302
C  -2.122627 0.62304 -0.533511
C  3.785378 -1.931838 0.454286
C  -1.821751 0.481275 0.815834
C  -1.136007 0.987678 -1.428677
C  -4.448569 1.05666 -0.511782
C  4.284931 -2.637034 1.555018
C  -4.326343 2.338141 0.012319
C  -5.691844 0.4396 -0.582616
C  4.379604 -4.006963 1.452191
C  3.503598 -3.839344 -0.745362
C  3.980403 -4.634984 0.273496
C  -5.460064 2.991458 0.476405
C  -6.81535 1.108719 -0.121946
C  -6.706342 2.384443 0.416476
H  2.543897 -0.276828 -1.098463
H  3.579248 1.957465 0.712079
H  2.612593 2.230131 -0.727015
H  4.224583 1.103126 -2.263067
H  5.313029 1.012515 -0.875509
H  4.940885 -0.437605 -1.8152
H  -0.297834 0.608009 2.309564
H  0.9097 1.491033 -1.719509
H  -2.586697 0.185468 1.522916
H  -1.369009 1.094178 -2.48034
H  4.586202 -2.112679 2.451829
H  -3.364539 2.831781 0.060052
H  -5.774996 -0.557591 -0.996071
H  4.763728 -4.585561 2.28188
H  3.183235 -4.281088 -1.681471
H  4.040574 -5.707118 0.153806
H  -5.361255 3.988149 0.885953
H  -7.780577 0.622792 -0.178138
H  -7.5836 2.900556 0.782266
elementType: O N C H
totalener: -1054.06763769 hartree
nucrepener: 1865.48687233 hartree
electener: -2919.55451002 hartree
oneelecener: -5138.47051970 hartree
twoeener: 2218.91600967 hartree
cpcmener: -0.03028486 hartree
kineticenergy: 1049.47358915 hartree
xcener: -102.360566476508 hartree
chargesum: -0.0000000
charge: -0.349720 -0.337058 -0.348210 -0.411654 0.169808 0.019742 -0.294524 0.302977 -0.241442 -0.184940 0.217137 0.438056 -0.147460 -0.241896 0.283435 -0.264816 -0.185329 -0.245740 -0.090002 -0.005017 -0.197695 -0.165622 -0.129815 -0.192219 0.071568 0.125053 0.107338 0.103963 0.097325 0.096545 0.142708 0.147082 0.160013 0.149626 0.146403 0.155803 0.147106 0.166479 0.141356 0.160028 0.162384 0.160368 0.160858
qa: -0.3497 -0.3371 -0.3482 -0.4117 0.1698 0.0197 -0.2945 0.3030 -0.2414 -0.1849 0.2171 0.4381 -0.1475 -0.2419 0.2834 -0.2648 -0.1853 -0.2457 -0.0900 -0.0050 -0.1977 -0.1656 -0.1298 -0.1922 0.0716 0.1251 0.1073 0.1040 0.0973 0.0965 0.1427 0.1471 0.1600 0.1496 0.1464 0.1558 0.1471 0.1665 0.1414 0.1600 0.1624 0.1604 0.1609
va: 2.0490 2.0791 2.0416 2.9676 3.6947 3.8923 3.9676 3.7509 4.0144 3.8233 3.7296 3.8643 3.9551 4.0384 3.6842 3.9529 3.8687 3.9861 3.8842 4.0496 3.8590 3.9053 3.8926 3.8933 1.0477 1.0049 0.9970 1.0056 1.0050 1.0120 1.0109 1.0029 0.9924 1.0062 1.0069 0.9990 1.0083 0.9869 0.9945 0.9919 0.9896 0.9880 0.9894
dispcorr: -0.018051389 hartree
energy: -1054.085689081902
dipole: 6.65172 -5.70817 0.94355 2.42557 -2.32417 0.10140 -2.47279 2.41541 -0.05738
magnitude: 0.95072 au
magnitude: 2.41653 debye
