program: Orca
programVersion: 5.0.2
elementType: O O O N C C C C C C C C C C C C C C C C C C C C H H H H H H H H H H H H H H H H H H H
charge: 0
multiplicity: 1
keywords: wb97x-d3
keywords: def2-TZVPP
keywords: def2/J RIJCOSX
keywords: DEFGRID2
keywords: scfconv7
keywords: smallprint printgap noloewdin
keywords: NOSOSCF
formula: C20H19NO3
InChI: InChI=1/C20H19NO3/c1-16(23-20-9-5-6-14-21-20)15-22-17-10-12-19(13-11-17)24-18-7-3-2-4-8-18/h2-14,16H,15H2,1H3
43 atoms
O  2.772951 2.225152 -0.217766
O  2.184864 -0.63288 -0.209739
O  -2.719292 2.388068 0.252169
N  2.96483 -2.800734 -0.185084
C  3.518166 -0.116572 -0.267606
C  3.440727 1.224711 -0.973208
C  4.121702 -0.032077 1.121016
C  1.411803 2.218205 -0.154082
C  0.836613 2.542133 1.069065
C  0.593868 1.963065 -1.252048
C  -1.348529 2.316801 0.113627
C  1.960211 -1.951606 -0.16099
C  -0.543206 2.590575 1.204901
C  -0.78371 2.008662 -1.114989
C  -3.438702 1.224598 0.204931
C  0.618374 -2.34658 -0.102369
C  -2.870185 -0.029859 0.392047
C  -4.805568 1.35156 -0.018197
C  0.345855 -3.695553 -0.065724
C  2.680856 -4.104883 -0.149959
C  1.399583 -4.60834 -0.088392
C  -3.681058 -1.15675 0.346368
C  -5.601521 0.217315 -0.053853
C  -5.045444 -1.043911 0.122636
H  4.138387 -0.757505 -0.900337
H  4.457765 1.591459 -1.114275
H  3.004929 1.103825 -1.968322
H  4.234115 -1.021368 1.562055
H  5.113679 0.417927 1.067103
H  3.513234 0.571247 1.794969
H  1.469867 2.748579 1.922656
H  1.012258 1.72919 -2.221676
H  -0.985671 2.833295 2.162646
H  -1.414514 1.805269 -1.971299
H  -0.172372 -1.607895 -0.090293
H  -1.810251 -0.141803 0.579063
H  -5.239617 2.333178 -0.161527
H  -0.67973 -4.037643 -0.018303
H  3.532124 -4.775187 -0.166726
H  1.227485 -5.674645 -0.059229
H  -3.231843 -2.130926 0.491716
H  -6.664475 0.32299 -0.227632
H  -5.669382 -1.926685 0.087198
elementType: O N C H
totalener: -1054.06390473 hartree
nucrepener: 1964.41625215 hartree
electener: -3018.48015688 hartree
oneelecener: -5335.95787658 hartree
twoeener: 2317.47771970 hartree
cpcmener: -0.02932674 hartree
kineticenergy: 1049.47070472 hartree
xcener: -102.359299463713 hartree
chargesum: -0.0000000
charge: -0.371922 -0.318465 -0.348628 -0.411694 0.184095 0.014822 -0.306663 0.250816 -0.198405 -0.195546 0.216702 0.422175 -0.183355 -0.169588 0.296712 -0.235068 -0.196531 -0.243240 -0.114069 -0.007048 -0.189923 -0.169741 -0.128517 -0.195486 0.074641 0.121919 0.115017 0.097099 0.102274 0.093735 0.143579 0.151749 0.148610 0.158552 0.139415 0.154945 0.146360 0.164884 0.142158 0.160115 0.164029 0.159566 0.159920
qa: -0.3719 -0.3185 -0.3486 -0.4117 0.1841 0.0148 -0.3067 0.2508 -0.1984 -0.1955 0.2167 0.4222 -0.1834 -0.1696 0.2967 -0.2351 -0.1965 -0.2432 -0.1141 -0.0070 -0.1899 -0.1697 -0.1285 -0.1955 0.0746 0.1219 0.1150 0.0971 0.1023 0.0937 0.1436 0.1517 0.1486 0.1586 0.1394 0.1549 0.1464 0.1649 0.1422 0.1601 0.1640 0.1596 0.1599
va: 2.0145 2.0943 2.0497 2.9736 3.7378 3.8781 3.9589 3.7839 3.9892 3.8528 3.7146 3.9241 3.9957 3.9318 3.6990 3.9127 3.8639 3.9827 3.9106 4.0484 3.8602 3.9027 3.8959 3.9005 1.0404 1.0001 1.0034 1.0168 1.0046 1.0039 1.0068 0.9996 1.0017 0.9961 1.0039 1.0024 1.0089 0.9891 0.9952 0.9921 0.9897 0.9880 0.9904
dispcorr: -0.021004981 hartree
energy: -1054.084909707754
dipole: 5.69904 -5.41185 0.28719 -6.19890 4.84347 -1.35544 0.85819 -1.36167 -0.50348
magnitude: 1.47417 au
magnitude: 3.74704 debye
