program: Orca
programVersion: 5.0.2
elementType: O O O N C C C C C C C C C C C C C C C C C C C C H H H H H H H H H H H H H H H H H H H
charge: 0
multiplicity: 1
keywords: wb97x-d3
keywords: def2-TZVPP
keywords: def2/J RIJCOSX
keywords: DEFGRID2
keywords: scfconv7
keywords: smallprint printgap noloewdin
keywords: NOSOSCF
formula: C20H19NO3
InChI: InChI=1/C20H19NO3/c1-16(23-20-9-5-6-14-21-20)15-22-17-10-12-19(13-11-17)24-18-7-3-2-4-8-18/h2-14,16H,15H2,1H3
43 atoms
O  1.596625 0.971283 -0.550383
O  4.556612 -0.901145 0.328451
O  -3.58911 2.104443 0.916816
N  3.40293 -2.791491 -0.31503
C  3.715807 -0.08407 -0.492324
C  2.443044 0.209514 0.290528
C  4.50998 1.160204 -0.825908
C  0.332379 1.217727 -0.137091
C  -0.489838 1.901366 -1.034025
C  -0.175835 0.835524 1.099108
C  -2.307975 1.787439 0.524769
C  4.367194 -2.230326 0.381237
C  -1.800086 2.191313 -0.705265
C  -1.500412 1.112632 1.419154
C  -4.64956 1.774044 0.117423
C  5.246697 -2.948536 1.198278
C  -4.62506 0.717905 -0.785909
C  -5.801713 2.533824 0.282077
C  5.086512 -4.314735 1.267727
C  3.262251 -4.116317 -0.235094
C  4.069307 -4.924696 0.535599
C  -5.76455 0.435897 -1.528382
C  -6.93319 2.233618 -0.460434
C  -6.920708 1.187383 -1.373758
H  3.460477 -0.618142 -1.41044
H  1.953935 -0.72619 0.577258
H  2.683075 0.763531 1.205757
H  5.425888 0.902113 -1.357787
H  3.932783 1.817159 -1.474898
H  4.775861 1.719896 0.072084
H  -0.094808 2.210406 -1.993534
H  0.430628 0.315595 1.827616
H  -2.419728 2.730281 -1.410911
H  -1.892877 0.804326 2.379653
H  6.024659 -2.441544 1.752581
H  -3.738298 0.111349 -0.915974
H  -5.8098 3.353051 0.989872
H  5.747672 -4.9048 1.888591
H  2.456403 -4.543314 -0.819996
H  3.910522 -5.992987 0.566177
H  -5.742346 -0.386583 -2.231421
H  -7.826756 2.829127 -0.326826
H  -7.802885 0.959302 -1.956468
elementType: O N C H
totalener: -1054.06747870 hartree
nucrepener: 1825.82013699 hartree
electener: -2879.88761569 hartree
oneelecener: -5058.68444057 hartree
twoeener: 2178.79682488 hartree
cpcmener: -0.02576674 hartree
kineticenergy: 1049.46517505 hartree
xcener: -102.357979883936 hartree
chargesum: 0.0000000
charge: -0.342468 -0.338194 -0.345845 -0.416841 0.219775 -0.022185 -0.272212 0.308961 -0.245336 -0.174230 0.245011 0.435071 -0.163058 -0.271982 0.305406 -0.260072 -0.201415 -0.260810 -0.089689 -0.010530 -0.195364 -0.159127 -0.123547 -0.196973 0.064436 0.113870 0.112845 0.099691 0.093287 0.090413 0.144972 0.143867 0.160110 0.148694 0.147158 0.156958 0.146734 0.165570 0.142972 0.160321 0.162468 0.160469 0.160818
qa: -0.3425 -0.3382 -0.3458 -0.4168 0.2198 -0.0222 -0.2722 0.3090 -0.2453 -0.1742 0.2450 0.4351 -0.1631 -0.2720 0.3054 -0.2601 -0.2014 -0.2608 -0.0897 -0.0105 -0.1954 -0.1591 -0.1235 -0.1970 0.0644 0.1139 0.1128 0.0997 0.0933 0.0904 0.1450 0.1439 0.1601 0.1487 0.1472 0.1570 0.1467 0.1656 0.1430 0.1603 0.1625 0.1605 0.1608
va: 2.0606 2.0962 2.0482 2.9570 3.7568 3.8031 3.9319 3.7776 3.9992 3.8368 3.7058 3.8647 3.9561 4.0667 3.6709 3.9553 3.8859 3.9930 3.8848 4.0542 3.8634 3.9005 3.8872 3.9005 1.0447 1.0062 0.9951 1.0083 1.0159 1.0066 1.0083 1.0082 0.9928 1.0072 1.0065 0.9985 1.0089 0.9872 0.9947 0.9916 0.9896 0.9881 0.9897
dispcorr: -0.017267147 hartree
energy: -1054.084745843156
dipole: 5.25435 -4.53370 0.72065 -1.16566 0.11603 -1.04963 -2.38314 2.58451 0.20137
magnitude: 1.28903 au
magnitude: 3.27646 debye
