program: Orca
programVersion: 5.0.2
elementType: O O O N C C C C C C C C C C C C C C C C C C C C H H H H H H H H H H H H H H H H H H H
charge: 0
multiplicity: 1
keywords: wb97x-d3
keywords: def2-TZVPP
keywords: def2/J RIJCOSX
keywords: DEFGRID2
keywords: scfconv7
keywords: smallprint printgap noloewdin
keywords: NOSOSCF
formula: C20H19NO3
InChI: InChI=1/C20H19NO3/c1-16(23-20-9-5-6-14-21-20)15-22-17-10-12-19(13-11-17)24-18-7-3-2-4-8-18/h2-14,16H,15H2,1H3
43 atoms
O  1.290607 0.559257 -0.587737
O  4.494931 -0.403677 0.767349
O  -4.17182 0.093948 -0.049568
N  4.266214 -2.357005 -0.436083
C  3.59289 0.268722 -0.114183
C  2.17154 -0.033805 0.347745
C  3.933928 1.741759 -0.041116
C  -0.042606 0.435695 -0.386817
C  -0.61583 -0.235209 0.687217
C  -0.868555 1.026927 -1.343915
C  -2.810748 0.269644 -0.158779
C  4.806365 -1.694692 0.563527
C  -2.00003 -0.307442 0.800136
C  -2.243286 0.940331 -1.236872
C  -5.010382 1.171631 -0.152129
C  5.723671 -2.258015 1.457417
C  -6.293735 0.914694 -0.62005
C  -4.642508 2.456299 0.230046
C  6.071933 -3.577576 1.272475
C  4.617443 -3.634397 -0.601007
C  5.508738 -4.29351 0.21699
C  -7.21178 1.950248 -0.705207
C  -5.570793 3.484063 0.129922
C  -6.855175 3.240713 -0.336497
H  3.729457 -0.094473 -1.135441
H  2.005418 -1.114612 0.394947
H  2.013411 0.379984 1.350513
H  4.966936 1.914488 -0.342924
H  3.298003 2.314452 -0.71408
H  3.79758 2.133184 0.968456
H  -0.011247 -0.705977 1.450195
H  -0.425855 1.547991 -2.183406
H  -2.440931 -0.830144 1.639419
H  -2.867891 1.392934 -1.996961
H  6.139239 -1.666395 2.261937
H  -6.568651 -0.091363 -0.911237
H  -3.648708 2.66238 0.606324
H  6.77823 -4.049665 1.942563
H  4.15139 -4.149145 -1.432762
H  5.756405 -5.33027 0.039625
H  -8.209903 1.745098 -1.069679
H  -5.282434 4.484234 0.425912
H  -7.571536 4.047908 -0.410311
elementType: O N C H
totalener: -1054.06754494 hartree
nucrepener: 1816.85158502 hartree
electener: -2870.91912996 hartree
oneelecener: -5040.76942528 hartree
twoeener: 2169.85029532 hartree
cpcmener: -0.02591395 hartree
kineticenergy: 1049.45258582 hartree
xcener: -102.355353383472 hartree
chargesum: -0.0000000
charge: -0.342303 -0.338407 -0.346909 -0.417018 0.221435 -0.027063 -0.270327 0.313200 -0.174150 -0.250592 0.245547 0.434581 -0.276994 -0.157485 0.295898 -0.259617 -0.257034 -0.195604 -0.090366 -0.010843 -0.194947 -0.124952 -0.156362 -0.195285 0.064477 0.116301 0.111481 0.099688 0.092456 0.090027 0.144288 0.144389 0.148591 0.160593 0.147382 0.146318 0.157440 0.166779 0.142286 0.159969 0.160458 0.161878 0.160795
qa: -0.3423 -0.3384 -0.3469 -0.4170 0.2214 -0.0271 -0.2703 0.3132 -0.1742 -0.2506 0.2455 0.4346 -0.2770 -0.1575 0.2959 -0.2596 -0.2570 -0.1956 -0.0904 -0.0108 -0.1949 -0.1250 -0.1564 -0.1953 0.0645 0.1163 0.1115 0.0997 0.0925 0.0900 0.1443 0.1444 0.1486 0.1606 0.1474 0.1463 0.1574 0.1668 0.1423 0.1600 0.1605 0.1619 0.1608
va: 2.0584 2.0965 2.0460 2.9550 3.7532 3.8043 3.9296 3.7714 3.8409 4.0071 3.7103 3.8626 4.0691 3.9496 3.6758 3.9554 3.9950 3.8858 3.8856 4.0566 3.8636 3.8862 3.8988 3.8983 1.0458 1.0057 0.9940 1.0083 1.0157 1.0068 1.0085 1.0091 1.0076 0.9926 1.0066 1.0087 0.9979 0.9869 0.9949 0.9918 0.9881 0.9897 0.9896
dispcorr: -0.017228773 hartree
energy: -1054.084773716274
dipole: 5.40538 -4.47482 0.93056 4.40773 -4.59426 -0.18653 0.99658 -0.40523 0.59134
magnitude: 1.11822 au
magnitude: 2.84229 debye
