program: Orca
programVersion: 5.0.2
elementType: O O O N C C C C C C C C C C C C C C C C C C C C H H H H H H H H H H H H H H H H H H H
charge: 0
multiplicity: 1
keywords: wb97x-d3
keywords: def2-TZVPP
keywords: def2/J RIJCOSX
keywords: DEFGRID2
keywords: scfconv7
keywords: smallprint printgap noloewdin
keywords: NOSOSCF
formula: C20H19NO3
InChI: InChI=1/C20H19NO3/c1-16(23-20-9-5-6-14-21-20)15-22-17-10-12-19(13-11-17)24-18-7-3-2-4-8-18/h2-14,16H,15H2,1H3
43 atoms
O  2.664337 1.30718 0.957849
O  3.75995 -1.072286 0.049309
O  -2.557101 1.780846 -0.744803
N  1.644275 -1.518592 -0.742274
C  3.903841 0.084827 -0.783474
C  3.782575 1.330025 0.089156
C  5.2663 0.033904 -1.438627
C  1.403392 1.435266 0.471276
C  0.377441 1.126988 1.363643
C  1.084066 1.843396 -0.817383
C  -1.259598 1.609419 -0.31978
C  2.530594 -1.597773 0.227383
C  -0.946944 1.221866 0.977854
C  -0.246729 1.915772 -1.211097
C  -3.518143 0.856322 -0.434001
C  2.282571 -2.241203 1.441473
C  -3.252544 -0.503053 -0.31928
C  -4.81377 1.336203 -0.288123
C  1.030065 -2.78623 1.636458
C  0.434222 -2.032847 -0.532451
C  0.06929 -2.67209 0.635191
C  -4.295967 -1.376598 -0.045006
C  -5.847354 0.449841 -0.024882
C  -5.594646 -0.909381 0.104489
H  3.134592 0.078033 -1.5558
H  4.646717 1.396994 0.752095
H  3.79069 2.222925 -0.544095
H  5.410096 0.915141 -2.063936
H  6.068629 0.01198 -0.699769
H  5.358045 -0.843016 -2.078585
H  0.620893 0.81272 2.370704
H  1.847847 2.093021 -1.541247
H  -1.725857 0.990373 1.693132
H  -0.48833 2.222733 -2.220743
H  3.047789 -2.294407 2.204128
H  -2.24867 -0.887764 -0.444081
H  -5.009258 2.396683 -0.384228
H  0.797406 -3.285236 2.568018
H  -0.273133 -1.932991 -1.347939
H  -0.92793 -3.071015 0.756607
H  -4.085682 -2.434347 0.045791
H  -6.854702 0.828816 0.087277
H  -6.401703 -1.597411 0.317045
elementType: O N C H
totalener: -1054.06482559 hartree
nucrepener: 2017.38582937 hartree
electener: -3071.45065496 hartree
oneelecener: -5442.26975258 hartree
twoeener: 2370.81909762 hartree
cpcmener: -0.03074903 hartree
kineticenergy: 1049.46717045 hartree
xcener: -102.363394343623 hartree
chargesum: 0.0000000
charge: -0.349166 -0.353581 -0.346131 -0.355660 0.164243 -0.006237 -0.279601 0.284035 -0.239181 -0.144623 0.286250 0.365441 -0.196707 -0.271736 0.266525 -0.247335 -0.148016 -0.235219 -0.082825 0.000172 -0.196222 -0.193593 -0.142355 -0.170803 0.092066 0.118278 0.112128 0.097426 0.092838 0.099797 0.140391 0.146329 0.156086 0.146148 0.144297 0.147470 0.146741 0.165688 0.145860 0.159563 0.159650 0.160699 0.160869
qa: -0.3492 -0.3536 -0.3461 -0.3557 0.1642 -0.0062 -0.2796 0.2840 -0.2392 -0.1446 0.2863 0.3654 -0.1967 -0.2717 0.2665 -0.2473 -0.1480 -0.2352 -0.0828 0.0002 -0.1962 -0.1936 -0.1424 -0.1708 0.0921 0.1183 0.1121 0.0974 0.0928 0.0998 0.1404 0.1463 0.1561 0.1461 0.1443 0.1475 0.1467 0.1657 0.1459 0.1596 0.1597 0.1607 0.1609
va: 2.0392 2.0457 2.0578 2.9806 3.7127 3.8924 3.9706 3.7174 3.9423 3.7950 3.6449 3.9822 3.9329 4.0466 3.7118 3.9469 3.8522 3.9761 3.8784 3.9949 3.8208 3.9312 3.8973 3.8821 1.0320 1.0001 0.9963 1.0040 1.0070 1.0057 1.0115 1.0000 0.9948 1.0085 1.0076 0.9943 1.0085 0.9870 0.9921 0.9920 0.9926 0.9882 0.9894
dispcorr: -0.023697853 hartree
energy: -1054.088523441582
dipole: 6.34545 -6.10858 0.23686 -2.10100 1.76533 -0.33567 -1.98470 2.14408 0.15938
magnitude: 0.44066 au
magnitude: 1.12006 debye
