program: Orca
programVersion: 5.0.2
elementType: O O O N C C C C C C C C C C C C C C C C C C C C H H H H H H H H H H H H H H H H H H H
charge: 0
multiplicity: 1
keywords: wb97x-d3
keywords: def2-TZVPP
keywords: def2/J RIJCOSX
keywords: DEFGRID2
keywords: scfconv7
keywords: smallprint printgap noloewdin
keywords: NOSOSCF
formula: C20H19NO3
InChI: InChI=1/C20H19NO3/c1-16(23-20-9-5-6-14-21-20)15-22-17-10-12-19(13-11-17)24-18-7-3-2-4-8-18/h2-14,16H,15H2,1H3
43 atoms
O  2.528257 2.013439 -0.1181
O  2.648108 -0.78696 0.915959
O  -2.781003 0.83152 -1.03687
N  3.438074 -2.060019 -0.833649
C  3.765203 0.10301 0.802791
C  3.586494 1.094761 -0.33692
C  3.908989 0.773335 2.152841
C  1.239739 1.648401 -0.356079
C  0.264317 2.346008 0.353008
C  0.845512 0.689965 -1.283094
C  -1.464518 1.105648 -0.751681
C  2.49474 -1.79531 0.044307
C  -1.080797 2.089669 0.150316
C  -0.501905 0.410218 -1.463252
C  -3.717945 0.787145 -0.039399
C  1.300618 -2.518533 0.135141
C  -3.438756 0.325533 1.241386
C  -5.004967 1.180719 -0.382716
C  1.109897 -3.556397 -0.74988
C  3.234188 -3.06704 -1.685609
C  2.096443 -3.844474 -1.691833
C  -4.459291 0.279693 2.181251
C  -6.016458 1.11724 0.563931
C  -5.748363 0.676002 1.852574
H  4.673232 -0.464649 0.583176
H  4.493238 1.698486 -0.39444
H  3.491843 0.584057 -1.296855
H  3.01144 1.318537 2.443584
H  4.125637 0.038457 2.927943
H  4.737782 1.479159 2.127553
H  0.561772 3.104517 1.066258
H  1.563464 0.14166 -1.876862
H  -1.817587 2.657181 0.70441
H  -0.797944 -0.348232 -2.176911
H  0.555028 -2.257088 0.873902
H  -2.44203 0.002121 1.512875
H  -5.210755 1.533058 -1.3856
H  0.197287 -4.13641 -0.713356
H  4.030448 -3.253849 -2.396392
H  1.981934 -4.647234 -2.406168
H  -4.239618 -0.075815 3.179218
H  -7.017507 1.424406 0.290913
H  -6.537189 0.635487 2.591679
elementType: O N C H
totalener: -1054.06465087 hartree
nucrepener: 1961.79609263 hartree
electener: -3015.86074350 hartree
oneelecener: -5330.95141811 hartree
twoeener: 2315.09067462 hartree
cpcmener: -0.02712929 hartree
kineticenergy: 1049.47536085 hartree
xcener: -102.363703920950 hartree
chargesum: 0.0000000
charge: -0.362827 -0.334733 -0.346301 -0.391799 0.214723 -0.021925 -0.301104 0.235035 -0.200209 -0.136192 0.298823 0.382878 -0.194531 -0.292276 0.311700 -0.250438 -0.211148 -0.261095 -0.089686 -0.010992 -0.182095 -0.149308 -0.122314 -0.196224 0.080441 0.127412 0.118150 0.091006 0.102400 0.096958 0.141861 0.145977 0.157676 0.146101 0.147139 0.159607 0.146527 0.165651 0.142119 0.159840 0.162078 0.160243 0.160852
qa: -0.3628 -0.3347 -0.3463 -0.3918 0.2147 -0.0219 -0.3011 0.2350 -0.2002 -0.1362 0.2988 0.3829 -0.1945 -0.2923 0.3117 -0.2504 -0.2111 -0.2611 -0.0897 -0.0110 -0.1821 -0.1493 -0.1223 -0.1962 0.0804 0.1274 0.1182 0.0910 0.1024 0.0970 0.1419 0.1460 0.1577 0.1461 0.1471 0.1596 0.1465 0.1657 0.1421 0.1598 0.1621 0.1602 0.1609
va: 2.0199 2.0729 2.0535 2.9623 3.6876 3.8321 3.9754 3.8251 3.9913 3.7976 3.6590 3.8944 3.9524 4.0278 3.6635 3.9062 3.9012 4.0034 3.8849 4.0436 3.8551 3.8889 3.8803 3.9011 1.0377 1.0018 1.0084 1.0073 1.0067 1.0031 1.0097 1.0026 0.9938 1.0113 1.0065 0.9965 1.0088 0.9871 0.9956 0.9910 0.9895 0.9881 0.9896
dispcorr: -0.021175678 hartree
energy: -1054.085826543279
dipole: 5.04126 -4.73341 0.30785 -0.60361 -0.20387 -0.80748 5.34990 -5.16198 0.18792
magnitude: 0.88437 au
magnitude: 2.24788 debye
