program: Orca
programVersion: 5.0.2
elementType: O O O N C C C C C C C C C C C C C C C C C C C C H H H H H H H H H H H H H H H H H H H
charge: 0
multiplicity: 1
keywords: wb97x-d3
keywords: def2-TZVPP
keywords: def2/J RIJCOSX
keywords: DEFGRID2
keywords: scfconv7
keywords: smallprint printgap noloewdin
keywords: NOSOSCF
formula: C20H19NO3
InChI: InChI=1/C20H19NO3/c1-16(23-20-9-5-6-14-21-20)15-22-17-10-12-19(13-11-17)24-18-7-3-2-4-8-18/h2-14,16H,15H2,1H3
43 atoms
O  2.8362 1.520427 0.509344
O  3.486967 -1.090753 -0.024786
O  -2.643369 1.968182 0.152554
N  1.362174 -1.88864 -0.405042
C  3.461115 -0.188648 -1.136982
C  3.675181 1.218494 -0.59221
C  4.563088 -0.561787 -2.103738
C  1.494883 1.626154 0.339834
C  0.725591 1.532219 1.498465
C  0.868049 1.832555 -0.88514
C  -1.270352 1.837466 0.210448
C  2.330337 -1.6018 0.439902
C  -0.652955 1.636654 1.434994
C  -0.514977 1.93462 -0.944758
C  -3.379317 0.894034 -0.267848
C  2.249413 -1.843335 1.812584
C  -4.713135 1.143033 -0.574733
C  -2.8606 -0.390338 -0.376858
C  1.08945 -2.408364 2.300199
C  0.244886 -2.425752 0.083143
C  0.053049 -2.707545 1.420428
C  -5.524515 0.101269 -0.995389
C  -3.68689 -1.42269 -0.80307
C  -5.017194 -1.187159 -1.116363
H  2.499435 -0.264773 -1.64578
H  4.690402 1.313405 -0.203339
H  3.569293 1.948141 -1.400996
H  4.399901 -1.558162 -2.512384
H  4.580931 0.139096 -2.937462
H  5.542079 -0.539733 -1.624116
H  1.212837 1.370627 2.451664
H  1.432511 1.918223 -1.803653
H  -1.244244 1.55814 2.338425
H  -0.998505 2.092389 -1.900585
H  3.071707 -1.584356 2.465539
H  -5.107664 2.147341 -0.484911
H  -1.827482 -0.598613 -0.132027
H  0.987238 -2.605493 3.359133
H  -0.530081 -2.651158 -0.640482
H  -0.87293 -3.147149 1.762321
H  -6.560189 0.302155 -1.236493
H  -3.276407 -2.420992 -0.887237
H  -5.652592 -1.996291 -1.450193
elementType: O N C H
totalener: -1054.06564696 hartree
nucrepener: 2021.89493404 hartree
electener: -3075.96058100 hartree
oneelecener: -5451.17639340 hartree
twoeener: 2375.21581239 hartree
cpcmener: -0.03113176 hartree
kineticenergy: 1049.47772164 hartree
xcener: -102.362477427742 hartree
chargesum: -0.0000000
charge: -0.350268 -0.353297 -0.348942 -0.367684 0.160929 0.000765 -0.283265 0.323160 -0.275634 -0.201962 0.199198 0.361159 -0.151605 -0.162669 0.256619 -0.245249 -0.211134 -0.131613 -0.082526 0.014041 -0.190062 -0.152979 -0.209516 -0.167434 0.090510 0.118789 0.110701 0.099210 0.098285 0.093136 0.142655 0.149132 0.149467 0.156581 0.144852 0.145632 0.123346 0.165658 0.147203 0.155809 0.159009 0.158501 0.161493
qa: -0.3503 -0.3533 -0.3489 -0.3677 0.1609 0.0008 -0.2833 0.3232 -0.2756 -0.2020 0.1992 0.3612 -0.1516 -0.1627 0.2566 -0.2452 -0.2111 -0.1316 -0.0825 0.0140 -0.1901 -0.1530 -0.2095 -0.1674 0.0905 0.1188 0.1107 0.0992 0.0983 0.0931 0.1427 0.1491 0.1495 0.1566 0.1449 0.1456 0.1233 0.1657 0.1472 0.1558 0.1590 0.1585 0.1615
va: 2.0435 2.0442 2.0533 2.9838 3.7116 3.8907 3.9775 3.6737 3.9537 3.8315 3.7430 3.9928 3.9484 3.9790 3.7637 3.9222 3.9581 3.8030 3.8799 3.9868 3.8327 3.9203 3.9352 3.8845 1.0341 1.0006 0.9957 1.0062 1.0044 1.0067 1.0112 1.0010 0.9990 0.9965 1.0076 1.0095 1.0228 0.9868 0.9960 0.9950 0.9886 0.9951 0.9889
dispcorr: -0.023493510 hartree
energy: -1054.089140471202
dipole: 5.53106 -5.16297 0.36809 -4.01961 3.62333 -0.39628 -5.79079 5.49324 -0.29756
magnitude: 0.61731 au
magnitude: 1.56907 debye
