program: Orca
programVersion: 5.0.2
elementType: O O O N C C C C C C C C C C C C C C C C C C C C H H H H H H H H H H H H H H H H H H H
charge: 0
multiplicity: 1
keywords: wb97x-d3
keywords: def2-TZVPP
keywords: def2/J RIJCOSX
keywords: DEFGRID2
keywords: scfconv7
keywords: smallprint printgap noloewdin
keywords: NOSOSCF
formula: C20H19NO3
InChI: InChI=1/C20H19NO3/c1-16(23-20-9-5-6-14-21-20)15-22-17-10-12-19(13-11-17)24-18-7-3-2-4-8-18/h2-14,16H,15H2,1H3
43 atoms
O  2.850837 1.54838 0.483577
O  3.511899 -1.037483 -0.099179
O  -2.6494 1.869592 0.418917
N  1.403231 -1.873329 -0.485073
C  3.446878 -0.128911 -1.205006
C  3.647086 1.279128 -0.657382
C  4.527085 -0.477803 -2.204815
C  1.499941 1.611949 0.381011
C  0.791916 1.483334 1.573985
C  0.805962 1.810742 -0.808856
C  -1.274845 1.753263 0.392528
C  2.374141 -1.594312 0.359378
C  -0.590812 1.551516 1.580461
C  -0.580168 1.87991 -0.798419
C  -3.403901 0.871021 -0.134184
C  2.310388 -1.880928 1.724182
C  -2.9202 -0.411947 -0.3598
C  -4.720849 1.1925 -0.444178
C  1.158437 -2.467883 2.205365
C  0.29495 -2.433467 -0.003659
C  0.11538 -2.749392 1.327748
C  -3.765501 -1.36903 -0.906761
C  -5.55248 0.224382 -0.984691
C  -5.080262 -1.060393 -1.224086
H  2.47427 -0.216704 -1.689931
H  4.675362 1.403261 -0.314188
H  3.481879 2.009596 -1.455493
H  5.52187 -0.423511 -1.760552
H  4.377899 -1.482189 -2.600258
H  4.494845 0.215944 -3.044827
H  1.328991 1.325744 2.50066
H  1.321078 1.918677 -1.753648
H  -1.132853 1.449538 2.511953
H  -1.1124 2.036066 -1.728388
H  3.135624 -1.634821 2.378349
H  -1.900366 -0.676495 -0.11172
H  -5.087788 2.194746 -0.261685
H  1.067448 -2.695563 3.259179
H  -0.481968 -2.648713 -0.728337
H  -0.805484 -3.202414 1.665815
H  -3.383708 -2.366722 -1.082165
H  -6.575523 0.481431 -1.226564
H  -5.730731 -1.810988 -1.652415
elementType: O N C H
totalener: -1054.06527854 hartree
nucrepener: 2019.99317454 hartree
electener: -3074.05845308 hartree
oneelecener: -5447.40281096 hartree
twoeener: 2373.34435788 hartree
cpcmener: -0.03104783 hartree
kineticenergy: 1049.47595960 hartree
xcener: -102.362245173349 hartree
chargesum: 0.0000000
charge: -0.351295 -0.353758 -0.348815 -0.366811 0.159965 0.003075 -0.283489 0.316397 -0.261338 -0.195185 0.215645 0.364872 -0.180580 -0.169316 0.240122 -0.243354 -0.120949 -0.205787 -0.086724 0.010536 -0.187625 -0.215533 -0.155446 -0.162931 0.090606 0.117988 0.110378 0.092896 0.098926 0.098783 0.142620 0.149098 0.148305 0.158426 0.144710 0.130688 0.146437 0.165565 0.146328 0.156241 0.159687 0.159124 0.161516
qa: -0.3513 -0.3538 -0.3488 -0.3668 0.1600 0.0031 -0.2835 0.3164 -0.2613 -0.1952 0.2156 0.3649 -0.1806 -0.1693 0.2401 -0.2434 -0.1209 -0.2058 -0.0867 0.0105 -0.1876 -0.2155 -0.1554 -0.1629 0.0906 0.1180 0.1104 0.0929 0.0989 0.0988 0.1426 0.1491 0.1483 0.1584 0.1447 0.1307 0.1464 0.1656 0.1463 0.1562 0.1597 0.1591 0.1615
va: 2.0430 2.0452 2.0508 2.9820 3.7053 3.8909 3.9788 3.6778 3.9494 3.8297 3.7292 3.9864 3.9706 3.9753 3.7593 3.9177 3.7997 3.9518 3.8806 3.9913 3.8313 3.9406 3.9218 3.8759 1.0351 1.0003 0.9955 1.0065 1.0062 1.0044 1.0108 1.0012 1.0007 0.9954 1.0075 1.0115 1.0089 0.9869 0.9964 0.9946 0.9944 0.9888 0.9889
dispcorr: -0.023411310 hartree
energy: -1054.088689854166
dipole: 5.28608 -4.99406 0.29202 -3.65887 3.26645 -0.39242 -6.46056 6.04638 -0.41419
magnitude: 0.64095 au
magnitude: 1.62917 debye
