program: Orca
programVersion: 5.0.2
elementType: O O O N C C C C C C C C C C C C C C C C C C C C H H H H H H H H H H H H H H H H H H H
charge: 0
multiplicity: 1
keywords: wb97x-d3
keywords: def2-TZVPP
keywords: def2/J RIJCOSX
keywords: DEFGRID2
keywords: scfconv7
keywords: smallprint printgap noloewdin
keywords: NOSOSCF
formula: C20H19NO3
InChI: InChI=1/C20H19NO3/c1-16(23-20-9-5-6-14-21-20)15-22-17-10-12-19(13-11-17)24-18-7-3-2-4-8-18/h2-14,16H,15H2,1H3
43 atoms
O  2.597872 1.378852 0.384773
O  3.736026 -1.04682 -0.521673
O  -2.888317 1.593655 0.785025
N  1.607842 -1.684988 0.083398
C  3.235419 -0.095385 -1.465625
C  3.308183 1.288161 -0.8345
C  4.111937 -0.165788 -2.697312
C  1.245389 1.438117 0.386842
C  0.629301 1.227178 1.61843
C  0.458545 1.703102 -0.729218
C  -1.5296 1.515852 0.61135
C  2.900326 -1.667574 0.322932
C  -0.748761 1.2572 1.729427
C  -0.924643 1.749842 -0.61274
C  -3.733023 0.955525 -0.075979
C  3.484369 -2.303266 1.424125
C  -3.404044 -0.22778 -0.728637
C  -4.990604 1.523934 -0.243443
C  2.652242 -2.970364 2.29615
C  0.815608 -2.326021 0.940467
C  1.278614 -2.984979 2.060117
C  -4.341074 -0.82702 -1.559599
C  -5.919125 0.907386 -1.068156
C  -5.59854 -0.266629 -1.736949
H  2.207504 -0.344527 -1.735025
H  4.344986 1.515806 -0.57855
H  2.985934 2.045181 -1.556168
H  4.070667 -1.158011 -3.14643
H  3.766258 0.548604 -3.444336
H  5.153214 0.064805 -2.466584
H  1.236837 1.016598 2.490032
H  0.894176 1.88051 -1.703016
H  -1.218738 1.079629 2.688834
H  -1.519745 1.96738 -1.491069
H  4.554589 -2.261395 1.577933
H  -2.432166 -0.686399 -0.596028
H  -5.236379 2.444152 0.272502
H  3.067148 -3.46983 3.16213
H  -0.244252 -2.307748 0.712126
H  0.593939 -3.490959 2.726106
H  -4.080997 -1.747084 -2.067717
H  -6.896424 1.35588 -1.193878
H  -6.321971 -0.741915 -2.386383
elementType: O N C H
totalener: -1054.07513806 hartree
nucrepener: 1973.65747228 hartree
electener: -3027.73261034 hartree
oneelecener: -5354.77392634 hartree
twoeener: 2327.04131600 hartree
cpcmener: -0.02516481 hartree
kineticenergy: 1049.48804079 hartree
xcener: -102.365498079776 hartree
chargesum: 0.0000000
charge: -0.338302 -0.330501 -0.335246 -0.376768 0.166627 -0.010293 -0.279138 0.286242 -0.219514 -0.175112 0.246049 0.390772 -0.213454 -0.205030 0.284657 -0.254613 -0.183196 -0.245574 -0.084947 -0.007304 -0.187869 -0.165625 -0.127788 -0.184661 0.086722 0.120708 0.107187 0.099566 0.095206 0.092873 0.134284 0.143192 0.143767 0.155467 0.141867 0.158091 0.143512 0.161945 0.139746 0.155745 0.156930 0.156540 0.157241
qa: -0.3383 -0.3305 -0.3352 -0.3768 0.1666 -0.0103 -0.2791 0.2862 -0.2195 -0.1751 0.2460 0.3908 -0.2135 -0.2050 0.2847 -0.2546 -0.1832 -0.2456 -0.0849 -0.0073 -0.1879 -0.1656 -0.1278 -0.1847 0.0867 0.1207 0.1072 0.0996 0.0952 0.0929 0.1343 0.1432 0.1438 0.1555 0.1419 0.1581 0.1435 0.1619 0.1397 0.1557 0.1569 0.1565 0.1572
va: 2.0553 2.0767 2.0657 2.9484 3.7267 3.9113 3.9691 3.7264 3.9440 3.8396 3.7054 3.9480 4.0082 3.9640 3.7027 3.9554 3.8782 3.9914 3.8924 4.0001 3.8623 3.9150 3.8940 3.8980 1.0348 1.0031 0.9965 1.0057 1.0048 1.0064 1.0111 1.0023 1.0046 0.9959 1.0080 0.9927 1.0094 0.9873 0.9899 0.9939 0.9918 0.9893 0.9905
dispcorr: -0.021402733 hartree
energy: -1054.096540787738
dipole: 4.80790 -4.30261 0.50529 -2.22174 1.84602 -0.37572 -8.09533 7.41244 -0.68288
magnitude: 0.92888 au
magnitude: 2.36102 debye
