program: Orca
programVersion: 5.0.2
elementType: O O O N C C C C C C C C C C C C C C C C C C C C H H H H H H H H H H H H H H H H H H H
charge: 0
multiplicity: 1
keywords: wb97x-d3
keywords: def2-TZVPP
keywords: def2/J RIJCOSX
keywords: DEFGRID2
keywords: scfconv7
keywords: smallprint printgap noloewdin
keywords: NOSOSCF
formula: C20H19NO3
InChI: InChI=1/C20H19NO3/c1-16(23-20-9-5-6-14-21-20)15-22-17-10-12-19(13-11-17)24-18-7-3-2-4-8-18/h2-14,16H,15H2,1H3
43 atoms
O  1.818199 0.345502 -0.355476
O  3.766687 -0.655169 1.33377
O  -3.501673 1.142087 -1.495511
N  4.135636 -1.839655 -0.609507
C  3.941238 0.597653 0.666622
C  2.576809 1.223952 0.450129
C  4.806266 1.470623 1.549626
C  0.515317 0.608298 -0.581296
C  -0.202868 -0.380872 -1.25217
C  -0.129436 1.781471 -0.199621
C  -2.182825 0.968026 -1.151293
C  3.748588 -1.80536 0.646333
C  -1.546206 -0.205007 -1.52967
C  -1.475833 1.958598 -0.490985
C  -4.436197 1.318881 -0.518351
C  3.325832 -2.9402 1.347858
C  -5.626157 1.92515 -0.906738
C  -4.259629 0.897343 0.794579
C  3.308407 -4.14265 0.676387
C  4.111485 -3.009504 -1.2456
C  3.707616 -4.189951 -0.657907
C  -6.637031 2.111922 0.022313
C  -5.280448 1.097563 1.714461
C  -6.469842 1.705027 1.339749
H  4.43194 0.444703 -0.295865
H  2.08326 1.39126 1.415338
H  2.702377 2.19715 -0.037892
H  4.349829 1.638546 2.526066
H  5.784412 1.014609 1.702106
H  4.964712 2.441007 1.079597
H  0.297673 -1.293989 -1.549533
H  0.396319 2.574625 0.314668
H  -2.098075 -0.980003 -2.046636
H  -1.965028 2.879654 -0.198855
H  3.019163 -2.863763 2.382381
H  -5.754272 2.246615 -1.932877
H  -3.343562 0.413716 1.108211
H  2.982205 -5.04041 1.18544
H  4.437791 -2.994503 -2.279339
H  3.704467 -5.113368 -1.219343
H  -7.559108 2.586861 -0.287391
H  -5.13799 0.768719 2.735836
H  -7.25849 1.85765 2.064421
elementType: O N C H
totalener: -1054.07758193 hartree
nucrepener: 1871.74071272 hartree
electener: -2925.81829465 hartree
oneelecener: -5150.82272627 hartree
twoeener: 2225.00443163 hartree
cpcmener: -0.02526710 hartree
kineticenergy: 1049.49606827 hartree
xcener: -102.363432142304 hartree
chargesum: -0.0000000
charge: -0.315032 -0.332167 -0.334672 -0.391704 0.196808 0.000199 -0.286310 0.300414 -0.232206 -0.193467 0.200279 0.411992 -0.177125 -0.201801 0.286148 -0.254756 -0.244709 -0.188461 -0.089615 -0.007336 -0.194841 -0.125152 -0.161987 -0.192073 0.081382 0.100340 0.106812 0.092471 0.100801 0.094946 0.142249 0.140616 0.145419 0.157393 0.142138 0.143759 0.152302 0.162296 0.138307 0.155160 0.156300 0.158275 0.156606
qa: -0.3150 -0.3322 -0.3347 -0.3917 0.1968 0.0002 -0.2863 0.3004 -0.2322 -0.1935 0.2003 0.4120 -0.1771 -0.2018 0.2861 -0.2548 -0.2447 -0.1885 -0.0896 -0.0073 -0.1948 -0.1252 -0.1620 -0.1921 0.0814 0.1003 0.1068 0.0925 0.1008 0.0949 0.1422 0.1406 0.1454 0.1574 0.1421 0.1438 0.1523 0.1623 0.1383 0.1552 0.1563 0.1583 0.1566
va: 2.0924 2.0904 2.0614 2.9663 3.7801 3.8651 3.9696 3.8070 3.9687 3.8746 3.7555 3.9104 4.0070 4.0058 3.7030 3.9463 3.9884 3.8735 3.8928 4.0493 3.8580 3.8982 3.9126 3.9027 1.0461 0.9981 0.9923 1.0058 1.0059 1.0049 1.0052 1.0091 1.0037 0.9962 1.0080 1.0095 1.0010 0.9879 0.9953 0.9935 0.9893 0.9909 0.9909
dispcorr: -0.017946916 hartree
energy: -1054.095528841862
dipole: 5.78502 -5.36068 0.42434 3.71023 -3.53395 0.17628 6.35400 -5.45643 0.89756
magnitude: 1.00834 au
magnitude: 2.56301 debye
