program: Orca
programVersion: 5.0.2
elementType: O O O N C C C C C C C C C C C C C C C C C C C C H H H H H H H H H H H H H H H H H H H
charge: 0
multiplicity: 1
keywords: wb97x-d3
keywords: def2-TZVPP
keywords: def2/J RIJCOSX
keywords: DEFGRID2
keywords: scfconv7
keywords: smallprint printgap noloewdin
keywords: NOSOSCF
formula: C20H19NO3
InChI: InChI=1/C20H19NO3/c1-16(23-20-9-5-6-14-21-20)15-22-17-10-12-19(13-11-17)24-18-7-3-2-4-8-18/h2-14,16H,15H2,1H3
43 atoms
O  1.82562 0.238523 -0.396764
O  4.275654 -0.586631 0.552513
O  -3.232066 2.181869 0.551057
N  3.437943 -2.443915 -0.527438
C  4.181687 0.213697 -0.630665
C  2.946331 1.086762 -0.531425
C  5.435271 1.058334 -0.717903
C  0.607376 0.775534 -0.187704
C  -0.417293 -0.124835 0.107893
C  0.320816 2.134061 -0.250712
C  -1.986479 1.683098 0.266456
C  3.767068 -1.826199 0.585619
C  -1.703438 0.322671 0.339528
C  -0.978532 2.580374 -0.031902
C  -4.339891 1.603467 0.003259
C  3.641994 -2.412499 1.850462
C  -4.350592 1.05005 -1.272239
C  -5.499893 1.632026 0.767243
C  3.13521 -3.692158 1.919832
C  2.947998 -3.679227 -0.443613
C  2.770764 -4.351818 0.747806
C  -5.530923 0.514604 -1.769136
C  -6.673654 1.102254 0.25291
C  -6.695467 0.534262 -1.01373
H  4.10768 -0.427344 -1.51071
H  3.026725 1.762626 0.328782
H  2.871702 1.700197 -1.436734
H  5.555677 1.697279 0.158655
H  6.320771 0.430587 -0.812194
H  5.391789 1.700183 -1.598624
H  -0.198166 -1.183967 0.166594
H  1.085699 2.863949 -0.478461
H  -2.47664 -0.394895 0.583373
H  -1.194756 3.639753 -0.087689
H  3.929965 -1.872437 2.742551
H  -3.455877 1.034246 -1.881522
H  -5.481138 2.069614 1.757577
H  3.018972 -4.174313 2.88206
H  2.68594 -4.152951 -1.383192
H  2.364758 -5.353472 0.762419
H  -5.53547 0.082479 -2.761698
H  -7.573365 1.127864 0.854107
H  -7.610626 0.113581 -1.408936
elementType: O N C H
totalener: -1054.07702027 hartree
nucrepener: 1874.23278225 hartree
electener: -2928.30980253 hartree
oneelecener: -5155.90838100 hartree
twoeener: 2227.59857847 hartree
cpcmener: -0.02509590 hartree
kineticenergy: 1049.48977324 hartree
xcener: -102.362696302444 hartree
chargesum: 0.0000000
charge: -0.314788 -0.333504 -0.335422 -0.387889 0.202300 -0.002250 -0.285893 0.288495 -0.235671 -0.174584 0.240084 0.405063 -0.155426 -0.273390 0.283810 -0.250689 -0.189638 -0.248789 -0.090550 -0.008803 -0.194817 -0.152015 -0.123855 -0.188797 0.079597 0.099999 0.105646 0.091946 0.100883 0.094459 0.143580 0.140463 0.156317 0.145422 0.142277 0.154522 0.144649 0.162055 0.138666 0.155353 0.158117 0.156570 0.156499
qa: -0.3148 -0.3335 -0.3354 -0.3879 0.2023 -0.0022 -0.2859 0.2885 -0.2357 -0.1746 0.2401 0.4051 -0.1554 -0.2734 0.2838 -0.2507 -0.1896 -0.2488 -0.0906 -0.0088 -0.1948 -0.1520 -0.1239 -0.1888 0.0796 0.1000 0.1056 0.0919 0.1009 0.0945 0.1436 0.1405 0.1563 0.1454 0.1423 0.1545 0.1446 0.1621 0.1387 0.1554 0.1581 0.1566 0.1565
va: 2.0920 2.0898 2.0604 2.9675 3.7826 3.8685 3.9688 3.8245 3.9751 3.8680 3.7264 3.9215 3.9360 4.0718 3.6979 3.9454 3.8915 3.9969 3.8929 4.0497 3.8575 3.9000 3.8911 3.9036 1.0448 0.9984 0.9917 1.0063 1.0058 1.0047 1.0051 1.0075 0.9949 1.0085 1.0077 0.9983 1.0088 0.9879 0.9953 0.9934 0.9907 0.9894 0.9910
dispcorr: -0.018037239 hartree
energy: -1054.095057512503
dipole: 6.48389 -6.09151 0.39238 0.73408 -0.82209 -0.08801 -2.96055 2.84205 -0.11849
magnitude: 0.41923 au
magnitude: 1.06559 debye
