program: Orca
programVersion: 5.0.2
elementType: O O O N C C C C C C C C C C C C C C C C C C C C H H H H H H H H H H H H H H H H H H H
charge: 0
multiplicity: 1
keywords: wb97x-d3
keywords: def2-TZVPP
keywords: def2/J RIJCOSX
keywords: DEFGRID2
keywords: scfconv7
keywords: smallprint printgap noloewdin
keywords: NOSOSCF
formula: C20H19NO3
InChI: InChI=1/C20H19NO3/c1-16(23-20-9-5-6-14-21-20)15-22-17-10-12-19(13-11-17)24-18-7-3-2-4-8-18/h2-14,16H,15H2,1H3
43 atoms
O  2.069642 1.089993 0.079554
O  3.986102 -0.877072 0.577463
O  -3.229775 2.564296 0.172109
N  3.247834 -2.691381 -0.628377
C  4.024383 -0.078993 -0.609685
C  2.6308 0.371353 -1.00156
C  4.972691 1.068418 -0.325526
C  0.763868 1.422999 0.02634
C  -0.051669 1.226392 -1.085503
C  0.222446 2.002708 1.172817
C  -1.923924 2.146268 0.109547
C  3.561782 -2.144871 0.526226
C  -1.390745 1.591136 -1.04133
C  -1.114662 2.354768 1.217152
C  -4.239069 1.698332 -0.130213
C  3.489984 -2.829919 1.745085
C  -5.432236 2.267232 -0.561072
C  -4.130783 0.319705 0.01497
C  3.069085 -4.1408 1.719906
C  2.842319 -3.961396 -0.635023
C  2.733508 -4.732228 0.50269
C  -6.517902 1.453756 -0.845938
C  -5.225218 -0.481694 -0.282178
C  -6.421086 0.074764 -0.71308
H  4.411553 -0.666758 -1.446596
H  2.707021 0.998676 -1.89774
H  2.011363 -0.494044 -1.255414
H  5.982136 0.69817 -0.145025
H  5.01575 1.732967 -1.188829
H  4.666577 1.658527 0.538755
H  0.332766 0.799102 -2.001353
H  0.852295 2.165774 2.038497
H  -2.008197 1.437333 -1.917776
H  -1.527361 2.796091 2.11567
H  3.757589 -2.338357 2.670938
H  -5.506994 3.342261 -0.668806
H  -3.211764 -0.13648 0.359915
H  2.999834 -4.703175 2.642141
H  2.590612 -4.37519 -1.60503
H  2.398072 -5.758059 0.44428
H  -7.443276 1.90467 -1.18081
H  -5.136341 -1.554577 -0.167871
H  -7.26836 -0.558153 -0.94142
elementType: O N C H
totalener: -1054.07795543 hartree
nucrepener: 1867.15775212 hartree
electener: -2921.23570755 hartree
oneelecener: -5141.48815767 hartree
twoeener: 2220.25245012 hartree
cpcmener: -0.02377994 hartree
kineticenergy: 1049.48822042 hartree
xcener: -102.362974315725 hartree
chargesum: -0.0000000
charge: -0.331399 -0.323951 -0.334562 -0.413415 0.199153 -0.020252 -0.284414 0.303243 -0.187687 -0.229173 0.218907 0.422012 -0.213234 -0.190258 0.290565 -0.252604 -0.250926 -0.190993 -0.089320 -0.006712 -0.194135 -0.123213 -0.158090 -0.192034 0.074399 0.122768 0.116307 0.101177 0.091123 0.091757 0.140148 0.140517 0.157714 0.144753 0.144983 0.144036 0.153465 0.162046 0.139112 0.156505 0.156369 0.158167 0.157144
qa: -0.3314 -0.3240 -0.3346 -0.4134 0.1992 -0.0203 -0.2844 0.3032 -0.1877 -0.2292 0.2189 0.4220 -0.2132 -0.1903 0.2906 -0.2526 -0.2509 -0.1910 -0.0893 -0.0067 -0.1941 -0.1232 -0.1581 -0.1920 0.0744 0.1228 0.1163 0.1012 0.0911 0.0918 0.1401 0.1405 0.1577 0.1448 0.1450 0.1440 0.1535 0.1620 0.1391 0.1565 0.1564 0.1582 0.1571
va: 2.0635 2.1140 2.0630 2.9708 3.8134 3.7641 3.9509 3.7854 3.8593 3.9932 3.7433 3.8959 3.9947 4.0131 3.7011 3.9513 3.9926 3.8821 3.8877 4.0508 3.8611 3.8933 3.9063 3.9039 1.0343 0.9926 1.0099 1.0068 1.0052 1.0140 1.0103 1.0088 0.9960 1.0041 1.0070 1.0094 0.9997 0.9884 0.9951 0.9928 0.9893 0.9908 0.9908
dispcorr: -0.017604065 hartree
energy: -1054.095559496062
dipole: 5.41057 -5.04889 0.36169 -2.79127 1.66290 -1.12837 -3.28958 2.80755 -0.48203
magnitude: 1.27922 au
magnitude: 3.25151 debye
