program: Orca
programVersion: 5.0.2
elementType: O O O N C C C C C C C C C C C C C C C C C C C C H H H H H H H H H H H H H H H H H H H
charge: 0
multiplicity: 1
keywords: wb97x-d3
keywords: def2-TZVPP
keywords: def2/J RIJCOSX
keywords: DEFGRID2
keywords: scfconv7
keywords: smallprint printgap noloewdin
keywords: NOSOSCF
formula: C20H19NO3
InChI: InChI=1/C20H19NO3/c1-16(23-20-9-5-6-14-21-20)15-22-17-10-12-19(13-11-17)24-18-7-3-2-4-8-18/h2-14,16H,15H2,1H3
43 atoms
O  2.557962 2.017268 -0.64186
O  2.977874 -0.415403 1.051511
O  -2.465126 -0.229304 -0.699829
N  2.866492 -1.551352 -0.951604
C  4.010417 0.458256 0.579074
C  3.45059 1.866298 0.447802
C  5.138958 0.42123 1.589302
C  1.298533 1.510341 -0.571611
C  0.525726 1.48021 0.584536
C  0.765695 1.017262 -1.758035
C  -1.264371 0.42442 -0.624809
C  2.403215 -1.3274 0.2577
C  -0.746732 0.926541 0.560654
C  -0.513534 0.489796 -1.789441
C  -3.5643 0.197188 -0.015856
C  1.305482 -2.008342 0.79878
C  -4.461919 -0.788897 0.376802
C  -3.836453 1.537135 0.234723
C  0.676539 -2.944182 0.009237
C  2.247467 -2.462422 -1.702494
C  1.150112 -3.182658 -1.280402
C  -5.63726 -0.432258 1.018966
C  -5.012958 1.877514 0.8888
C  -5.917224 0.901666 1.284019
H  4.372369 0.119683 -0.393252
H  3.007398 2.191635 1.394485
H  4.277761 2.545053 0.23498
H  5.958938 1.061306 1.263564
H  4.813474 0.763608 2.573295
H  5.531452 -0.590659 1.692126
H  0.90289 1.861526 1.523835
H  1.362546 1.040939 -2.6613
H  -1.316983 0.879995 1.479899
H  -0.917157 0.099752 -2.715516
H  0.967301 -1.790396 1.803029
H  -4.238999 -1.828418 0.170157
H  -3.149767 2.313259 -0.078509
H  -0.181064 -3.483751 0.390363
H  2.656372 -2.61616 -2.694801
H  0.680235 -3.905852 -1.931796
H  -6.334135 -1.204828 1.317678
H  -5.223896 2.921201 1.083595
H  -6.833007 1.17784 1.7898
elementType: O N C H
totalener: -1054.07257728 hartree
nucrepener: 2006.69772172 hartree
electener: -3060.77029900 hartree
oneelecener: -5421.10829356 hartree
twoeener: 2360.33799457 hartree
cpcmener: -0.02457210 hartree
kineticenergy: 1049.48972740 hartree
xcener: -102.366709258288 hartree
chargesum: -0.0000000
charge: -0.352993 -0.323102 -0.333430 -0.373015 0.175822 0.014961 -0.284444 0.230906 -0.115682 -0.169986 0.305381 0.400712 -0.240241 -0.273014 0.322858 -0.270547 -0.271055 -0.221617 -0.081853 -0.008557 -0.187629 -0.113260 -0.141689 -0.196840 0.074584 0.098063 0.114777 0.095009 0.092695 0.098587 0.142429 0.135382 0.153927 0.139652 0.140291 0.141995 0.154831 0.161918 0.137596 0.153926 0.156898 0.158303 0.157453
qa: -0.3530 -0.3231 -0.3334 -0.3730 0.1758 0.0150 -0.2844 0.2309 -0.1157 -0.1700 0.3054 0.4007 -0.2402 -0.2730 0.3229 -0.2705 -0.2711 -0.2216 -0.0819 -0.0086 -0.1876 -0.1133 -0.1417 -0.1968 0.0746 0.0981 0.1148 0.0950 0.0927 0.0986 0.1424 0.1354 0.1539 0.1397 0.1403 0.1420 0.1548 0.1619 0.1376 0.1539 0.1569 0.1583 0.1575
va: 2.0436 2.0821 2.0467 2.9750 3.7406 3.8723 3.9707 3.7332 3.7912 3.9461 3.5829 3.9194 3.9344 4.0021 3.6714 3.9061 4.0116 3.9131 3.8654 4.0337 3.8298 3.8811 3.8906 3.9116 1.0495 0.9987 1.0021 1.0055 1.0053 1.0061 1.0036 1.0124 0.9985 1.0096 1.0106 1.0116 1.0001 0.9884 0.9961 0.9941 0.9894 0.9905 0.9910
dispcorr: -0.022878068 hartree
energy: -1054.095455345622
dipole: 6.01671 -5.91062 0.10608 1.39689 -1.39424 0.00265 5.90281 -4.95111 0.95170
magnitude: 0.95760 au
magnitude: 2.43402 debye
