program: Orca
programVersion: 5.0.2
elementType: O O O N C C C C C C C C C C C C C C C C C C C C H H H H H H H H H H H H H H H H H H H
charge: 0
multiplicity: 1
keywords: wb97x-d3
keywords: def2-TZVPP
keywords: def2/J RIJCOSX
keywords: DEFGRID2
keywords: scfconv7
keywords: smallprint printgap noloewdin
keywords: NOSOSCF
formula: C20H19NO3
InChI: InChI=1/C20H19NO3/c1-16(23-20-9-5-6-14-21-20)15-22-17-10-12-19(13-11-17)24-18-7-3-2-4-8-18/h2-14,16H,15H2,1H3
43 atoms
O  2.107632 1.517453 0.965315
O  3.547465 -0.852927 0.52919
O  -3.055614 2.384793 -0.744902
N  2.797452 -2.57862 -0.79191
C  3.362627 0.062326 -0.554103
C  3.212938 1.430741 0.087907
C  4.549383 0.048316 -1.498425
C  0.862556 1.701397 0.471363
C  -0.159724 1.787296 1.419105
C  0.546536 1.826733 -0.877417
C  -1.77736 2.116328 -0.321862
C  3.257841 -2.147859 0.363065
C  -1.468301 1.999991 1.029127
C  -0.77373 2.026029 -1.267345
C  -4.076356 1.554348 -0.386709
C  3.467223 -2.984274 1.466395
C  -3.895134 0.208826 -0.082965
C  -5.35053 2.111654 -0.376706
C  3.168623 -4.321158 1.323102
C  2.509619 -3.874687 -0.912005
C  2.675487 -4.789879 0.105805
C  -4.999735 -0.56862 0.242011
C  -6.443363 1.320437 -0.056354
C  -6.27531 -0.022188 0.261452
H  2.456867 -0.204114 -1.104598
H  4.090676 1.64798 0.700632
H  3.170694 2.199251 -0.689728
H  4.679043 -0.930172 -1.95896
H  4.395841 0.769789 -2.302355
H  5.474153 0.31081 -0.981285
H  0.079968 1.698581 2.471772
H  1.300837 1.770038 -1.650403
H  -2.244217 2.077985 1.781295
H  -1.009963 2.117565 -2.320311
H  3.850481 -2.585142 2.39638
H  -2.910428 -0.24115 -0.100595
H  -5.480145 3.159683 -0.620886
H  3.316861 -4.99859 2.154327
H  2.132892 -4.189621 -1.879132
H  2.430304 -5.832016 -0.043548
H  -4.853708 -1.615303 0.479599
H  -7.431708 1.762642 -0.048267
H  -7.129245 -0.635207 0.519538
elementType: O N C H
totalener: -1054.07744807 hartree
nucrepener: 1878.74958950 hartree
electener: -2932.82703757 hartree
oneelecener: -5164.64868183 hartree
twoeener: 2231.82164426 hartree
cpcmener: -0.02513893 hartree
kineticenergy: 1049.45562184 hartree
xcener: -102.357357453462 hartree
chargesum: -0.0000000
charge: -0.331389 -0.324271 -0.333981 -0.412017 0.170152 0.017689 -0.299040 0.305334 -0.244540 -0.175568 0.221108 0.438203 -0.149537 -0.254133 0.289640 -0.259351 -0.190893 -0.250630 -0.088006 -0.007506 -0.194247 -0.158320 -0.123011 -0.192170 0.068131 0.123143 0.106102 0.099111 0.101381 0.096425 0.139859 0.141793 0.156579 0.145913 0.143232 0.153312 0.143986 0.162290 0.137820 0.155796 0.158224 0.156195 0.157192
qa: -0.3314 -0.3243 -0.3340 -0.4120 0.1702 0.0177 -0.2990 0.3053 -0.2445 -0.1756 0.2211 0.4382 -0.1495 -0.2541 0.2896 -0.2594 -0.1909 -0.2506 -0.0880 -0.0075 -0.1942 -0.1583 -0.1230 -0.1922 0.0681 0.1231 0.1061 0.0991 0.1014 0.0964 0.1399 0.1418 0.1566 0.1459 0.1432 0.1533 0.1440 0.1623 0.1378 0.1558 0.1582 0.1562 0.1572
va: 2.0706 2.0967 2.0605 2.9663 3.6925 3.8916 3.9580 3.7727 4.0182 3.8127 3.7451 3.8692 3.9591 4.0519 3.6968 3.9565 3.8804 3.9921 3.8869 4.0583 3.8618 3.9082 3.8948 3.9033 1.0467 1.0051 0.9988 1.0143 1.0058 1.0059 1.0116 1.0046 0.9935 1.0081 1.0076 0.9999 1.0094 0.9881 0.9951 0.9932 0.9908 0.9894 0.9907
dispcorr: -0.017976849 hartree
energy: -1054.095424914538
dipole: 6.21717 -5.47494 0.74223 -3.60892 2.81675 -0.79217 -3.15396 3.04497 -0.10899
magnitude: 1.09102 au
magnitude: 2.77315 debye
