program: Orca
programVersion: 5.0.2
elementType: O O O N C C C C C C C C C C C C C C C C C C C C H H H H H H H H H H H H H H H H H H H
charge: 0
multiplicity: 1
keywords: wb97x-d3
keywords: def2-TZVPP
keywords: def2/J RIJCOSX
keywords: DEFGRID2
keywords: scfconv7
keywords: smallprint printgap noloewdin
keywords: NOSOSCF
formula: C20H19NO3
InChI: InChI=1/C20H19NO3/c1-16(23-20-9-5-6-14-21-20)15-22-17-10-12-19(13-11-17)24-18-7-3-2-4-8-18/h2-14,16H,15H2,1H3
43 atoms
O  2.053442 1.506882 -1.283266
O  2.951276 -0.670274 0.374089
O  -2.973968 2.006598 0.914883
N  3.669619 -2.63546 -0.577578
C  3.843204 0.078446 -0.453075
C  3.269728 1.478009 -0.558626
C  5.235564 0.112196 0.148659
C  0.852941 1.605903 -0.668805
C  0.616399 1.412691 0.688198
C  -0.218199 1.935187 -1.501458
C  -1.730053 1.845978 0.357371
C  2.942779 -2.006573 0.319846
C  -0.674781 1.525915 1.19146
C  -1.498937 2.058201 -0.996668
C  -4.057098 1.404829 0.342297
C  2.128692 -2.663881 1.249734
C  -3.980669 0.187732 -0.325979
C  -5.279387 2.048504 0.493317
C  2.094633 -4.040001 1.211138
C  3.623088 -3.967619 -0.602499
C  2.85707 -4.720133 0.262434
C  -5.13647 -0.370191 -0.854553
C  -6.426718 1.472987 -0.031238
C  -6.362127 0.265638 -0.71402
H  3.881313 -0.364401 -1.45188
H  3.171789 1.94289 0.427072
H  3.976505 2.085086 -1.128667
H  5.64912 -0.890977 0.245034
H  5.909498 0.682702 -0.491401
H  5.231467 0.577501 1.135919
H  1.408632 1.151058 1.374055
H  -0.040283 2.102961 -2.556565
H  -0.85047 1.362287 2.247454
H  -2.309086 2.327278 -1.663218
H  1.550816 -2.100547 1.970498
H  -3.035494 -0.328305 -0.437464
H  -5.327774 2.994017 1.019239
H  1.479636 -4.584929 1.915777
H  4.232977 -4.449755 -1.358165
H  2.856197 -5.79933 0.202307
H  -5.072513 -1.315869 -1.377597
H  -7.375818 1.979667 0.088728
H  -7.257968 -0.17613 -1.130102
elementType: O N C H
totalener: -1054.07552821 hartree
nucrepener: 1888.24423415 hartree
electener: -2942.31976235 hartree
oneelecener: -5183.73319980 hartree
twoeener: 2241.41343744 hartree
cpcmener: -0.02320767 hartree
kineticenergy: 1049.48177917 hartree
xcener: -102.361808551805 hartree
chargesum: -0.0000000
charge: -0.339780 -0.318250 -0.335761 -0.406443 0.164465 0.033693 -0.294405 0.296481 -0.159610 -0.235023 0.244004 0.437965 -0.275065 -0.164582 0.284377 -0.264429 -0.190213 -0.247860 -0.088179 -0.004194 -0.194529 -0.153744 -0.124376 -0.189449 0.066792 0.105495 0.120698 0.096326 0.100115 0.094787 0.130921 0.138725 0.144416 0.155683 0.143713 0.154118 0.144264 0.162038 0.139445 0.155985 0.158518 0.156620 0.156250
qa: -0.3398 -0.3183 -0.3358 -0.4064 0.1645 0.0337 -0.2944 0.2965 -0.1596 -0.2350 0.2440 0.4380 -0.2751 -0.1646 0.2844 -0.2644 -0.1902 -0.2479 -0.0882 -0.0042 -0.1945 -0.1537 -0.1244 -0.1894 0.0668 0.1055 0.1207 0.0963 0.1001 0.0948 0.1309 0.1387 0.1444 0.1557 0.1437 0.1541 0.1443 0.1620 0.1394 0.1560 0.1585 0.1566 0.1563
va: 2.0561 2.0939 2.0595 2.9761 3.7768 3.8501 3.9508 3.7767 3.8095 4.0097 3.7244 3.8780 4.0508 3.9570 3.6988 3.9597 3.8876 3.9958 3.8927 4.0496 3.8647 3.9024 3.8921 3.9036 1.0423 1.0015 0.9992 1.0144 1.0073 1.0043 1.0292 1.0116 1.0090 0.9940 1.0050 0.9988 1.0091 0.9883 0.9959 0.9930 0.9906 0.9893 0.9910
dispcorr: -0.018489509 hartree
energy: -1054.094017715733
dipole: 7.78828 -7.09705 0.69122 -2.69888 2.03469 -0.66419 -0.11734 0.42438 0.30704
magnitude: 1.00659 au
magnitude: 2.55854 debye
