program: Gaussian 09
title: 000006625
version: EM64L-G09RevD.01
frameworkgroup: C1[X(C12H8Cl2O2S)]
method: RPBEPBE
basis: SDD
operation: Freq
keyword: #p
keyword: freq=noraman
keyword: PBEPBE/SDD
title: #p freq=noraman PBEPBE/SDD
converged: YES YES NO NO
title: Mulliken charges:
elementType: Cl Cl S O O C C C C C C C C C C C C H H H H H H H H
charge: -0.028325 -0.028288 0.872522 -0.529563 -0.529591 -0.062107 -0.062338 -0.227675 -0.227543 -0.226769 -0.226738 -0.185222 -0.185218 -0.185246 -0.185213 -0.101525 -0.101557 0.286304 0.286292 0.285901 0.285972 0.268992 0.268992 0.268970 0.268973
chargesum: 0.00000
title: Mulliken charges with hydrogens summed into heavy atoms:
elementType: Cl Cl S O O C C C C C C C C C C C C
charge: -0.028325 -0.028288 0.872522 -0.529563 -0.529591 -0.062107 -0.062338 0.058629 0.058749 0.059132 0.059233 0.083771 0.083774 0.083724 0.083760 -0.101525 -0.101557
polarizability: 2.38976408e+02 -5.88860349e-03 1.35223031e+02 -1.65625331e-01 -2.26706168e-02 1.59700812e+02
1716.lowfreq: -9.2208 -7.5227 -3.4766 0.0021 0.0023 0.0027 21.8849 24.0692 39.8239
frequency: 21.8848 24.0622 39.7045 78.2415 106.6301 118.7112 142.1496 205.4005 205.9087 236.4209 263.4511 264.3190 299.0304 328.2083 382.9700 398.3965 399.7213 409.1204 410.4568 458.9535 479.2145 512.9086 536.8488 611.0853 612.6805 697.0521 697.8807 706.7367 710.5599 785.9006 831.9517 836.1204 836.6252 842.0486 927.3389 956.9813 960.7951 970.2713 974.3754 981.4611 986.9742 1045.5719 1051.4702 1064.8372 1066.4099 1100.8590 1107.2410 1170.8390 1175.7291 1278.3528 1281.3524 1375.6426 1378.2218 1380.9412 1384.4922 1448.9852 1451.8773 1567.5761 1568.4513 1595.6085 1599.5743 3155.2129 3155.3588 3157.0288 3157.1905 3177.6993 3177.9366 3180.2123 3180.6139
redmass: 18.7034 3.7756 4.2026 10.3696 11.6600 9.0745 10.4962 13.6858 14.5744 11.4006 8.0766 8.0466 8.5623 4.7404 11.4255 11.3463 6.7223 2.8894 2.9261 8.0083 3.8623 3.4897 7.2030 7.1008 7.1511 4.9250 6.9716 4.0725 5.1702 14.2315 1.2417 1.2500 1.4393 1.4693 16.4560 1.3434 1.3613 1.3727 1.3698 7.1593 6.3023 2.5848 2.6611 3.2577 3.2170 1.3119 1.3247 1.1295 1.1282 1.2335 1.2332 2.9438 3.1890 11.3941 8.8138 2.1451 2.1421 6.1746 6.1165 8.2418 8.2235 1.0895 1.0898 1.0894 1.0897 1.0961 1.0962 1.0972 1.0974
irintensity: 0.0005 0.0000 0.0020 3.0252 6.0558 0.6440 0.0001 7.8557 1.3437 0.0001 0.4382 4.7567 4.3803 0.0000 17.7786 81.2734 0.4890 0.0000 0.0448 3.6671 5.6878 64.0083 125.3753 0.0000 0.8829 26.7809 11.9539 0.0018 59.1145 127.5379 0.0064 2.2040 30.2244 56.2545 69.2800 0.0039 0.0333 0.0000 0.0444 64.3635 12.5191 47.5372 14.5406 83.8324 33.7615 0.0000 13.1636 16.9270 0.4755 0.0000 5.1207 0.0005 37.2675 0.0002 0.0001 92.0782 25.4081 31.8237 22.9863 0.0004 3.9028 0.0116 2.1887 2.3307 2.9165 0.0011 0.2870 5.0115 2.1401
temp: 298.150 k
press: 1.00000 atm
elementType: 17 17 16 8 8 6 6 6 6 6 6 6 6 6 6 6 6 1 1 1 1 1 1 1 1
symmnumber: 1
zpe: 434751.9 jmol-1
zpe.correction: 0.165588 hartree
zpe.thermalcorrener: 0.181418 hartree
zpe.thermalcorrenthalpy: 0.182362 hartree
zpe.thermalcorrgfe: 0.119403 hartree
zpe.sumelectzpe: -1929.335566 hartree
zpe.sumelectthermal: -1929.319736 hartree
zpe.sumelectthermalent: -1929.318792 hartree
zpe.sumelectthermalfe: -1929.381752 hartree
dipole: -0.0015 -4.1477 -0.0007
dipole: 4.1477
quadrupole: -121.7736 -142.4232 -108.2158
quadrupole: 0.0011 -0.0479 -0.0113
quadrupole: 2.3640 -18.2857 15.9217 0.0011 -0.0479 -0.0113
hfenergy: -1929.5011541 hartree
pointgroup: C01 [X(C12H8Cl2O2S1)]
dipole: 0.0016632 1.6318155 -0.0003585 debye
dipolederiv: -0.6716296 -0.3567608 -0.0010184 -0.4386262 -0.3081963 -0.0005295 -0.0010054 -0.0003978 -0.1031008 -0.669193 0.3578223 -0.0011602 0.4397655 -0.3105871 0.0006538 -0.0011832 0.0005193 -0.1030826 2.1812794 -0.0008688 0.0011007 -0.0007045 1.5338809 -0.0000558 0.001356 -0.0000399 0.9922696 -0.7902432 0.0005743 -0.0002031 0.0000262 -0.6145613 -0.0517382 -0.0011131 -0.1794164 -0.5582986 -0.7902415 -0.0000799 -0.0000397 0.0001972 -0.6144598 0.0517531 0.0000035 0.1794008 -0.5584096 -0.132348 0.0410599 0.0001149 0.1298731 -0.2818143 0.0000064 0.0003078 0.0000346 -0.1540004 -0.1337732 -0.0410846 0.0001027 -0.1296274 -0.2816574 0.000015 0.0002916 -0.0000119 -0.1540723 -0.1431812 0.0146253 -0.0789843 -0.0312348 -0.0692116 -0.0814719 0.2395088 0.1236596 -0.0122771 -0.1427962 -0.0145908 -0.0787792 0.0310461 -0.068999 0.0816967 0.2390349 -0.1243449 -0.0122382 -0.1432436 0.0139929 0.0788937 -0.0294313 -0.0687 0.08104 -0.2390383 -0.1240472 -0.0120917 -0.14277 -0.0140415 0.0786684 0.0293948 -0.0685281 -0.0812923 -0.2387432 0.1247081 -0.0121559 -0.2946086 -0.1246316 0.1137662 -0.14813 -0.1622998 0.0781502 0.0502901 0.0275657 0.0019626 -0.2939271 0.1250634 0.1135058 0.1486428 -0.1631819 -0.0785013 0.0503505 -0.0278081 0.0019956 -0.2947498 -0.1240168 -0.1142454 -0.1479336 -0.1618031 -0.0790885 -0.0506806 -0.0283063 0.0012464 -0.293965 0.1244341 -0.1141652 0.1483942 -0.1626714 0.0795254 -0.0509361 0.0286363 0.0012042 0.9666278 0.636888 0.0017532 0.7246291 0.3985028 0.000467 0.0016334 0.0003972 0.1592569 0.96248 -0.6385779 0.0019619 -0.7264231 0.4026893 -0.0006968 0.0018986 -0.00061 0.1593454 0.1421312 -0.0295378 0.0605813 -0.0088727 0.128117 0.0383775 0.0436086 0.0047272 0.0721053 0.1422 0.029523 0.0605135 0.0088244 0.1279976 -0.0385259 0.0436629 -0.0048383 0.0721267 0.1414754 -0.0295484 -0.0608102 -0.0090414 0.12811 -0.0380538 -0.0441486 -0.0044604 0.0713342 0.1417079 0.029487 -0.060658 0.0088958 0.1280372 0.0382168 -0.0440643 0.0045782 0.0713988 0.064396 -0.0617641 -0.0458318 -0.0729484 0.1227295 -0.0303064 -0.0424819 -0.0248293 0.0187591 0.0648882 0.0618894 -0.0457089 0.0731085 0.1223222 0.0304641 -0.042397 0.0249844 0.0187295 0.0645297 -0.062023 0.0453588 -0.0731723 0.1223419 0.0309745 0.0419459 0.0255439 0.0189816 0.0649543 0.0621664 0.0452834 0.0733482 0.1219428 -0.0310803 0.0418993 -0.0256446 0.0190117 unknown
polarizability: 238.9753706|-0.1374852|135.2231989|0.3085838|-0.0136388|159.7016814 unknown
InChI: InChI=1S/C12H8Cl2O2S/c13-9-1-5-11(6-2-9)17(15,16)12-7-3-10(14)4-8-12/h1-8H
charge 0 multiplicity 1
25 atoms
Cl 5.241791 2.07294 0.008268
Cl -5.232625 2.088027 -0.009166
S  -0.001289 -1.712885 0.000397
O  -0.0002 -2.481221 -1.445576
O  -0.004372 -2.480523 1.446769
C  1.512275 -0.568344 0.00239
C  -1.511211 -0.564569 -0.002091
C  2.062151 -0.203418 1.241123
C  -2.059565 -0.197998 -1.240989
C  2.060643 -0.195832 -1.234755
C  -2.058909 -0.19054 1.23486
C  3.214178 0.615476 1.241939
C  -3.209079 0.624421 -1.242186
C  3.212521 0.623272 -1.231905
C  -3.208299 0.632055 1.231647
C  3.761159 1.019206 0.005922
C  -3.755285 1.029749 -0.00635
H  1.624022 -0.571551 2.174486
H  -1.622198 -0.567358 -2.174215
H  1.621776 -0.558138 -2.170017
H  -1.621424 -0.554149 2.170254
H  3.678997 0.924741 2.181914
H  -3.67261 0.935154 -2.182311
H  3.676077 0.938468 -2.170537
H  -3.671224 0.948618 2.17013
