program: Orca
programVersion: 5.0.2
elementType: O O O N C C C C C C C C C C C C C C C C C C C C H H H H H H H H H H H H H H H H H H H
charge: 0
multiplicity: 1
keywords: wb97x-d3
keywords: def2-TZVPP
keywords: def2/J RIJCOSX
keywords: DEFGRID2
keywords: scfconv7
keywords: smallprint printgap noloewdin
keywords: NOSOSCF
formula: C20H19NO3
InChI: InChI=1/C20H19NO3/c1-16(23-20-9-5-6-14-21-20)15-22-17-10-12-19(13-11-17)24-18-7-3-2-4-8-18/h2-14,16H,15H2,1H3
43 atoms
O  2.509247 1.919034 -0.827394
O  3.284647 -0.358476 0.697605
O  -2.361388 0.298941 1.167219
N  2.684228 -1.99245 -0.798197
C  4.168552 0.218785 -0.257332
C  3.400441 0.956942 -1.351515
C  5.087731 1.133166 0.527465
C  1.295575 1.491143 -0.388345
C  0.84959 1.963661 0.838976
C  0.475776 0.643488 -1.126966
C  -1.189152 0.719627 0.600618
C  2.508202 -1.391747 0.357557
C  -0.391987 1.59099 1.325814
C  -0.754102 0.246405 -0.628193
C  -3.529111 0.37102 0.473842
C  1.529091 -1.770616 1.282469
C  -4.534132 -0.504701 0.86769
C  -3.759439 1.285356 -0.547592
C  0.708119 -2.8215 0.947556
C  1.88472 -3.012184 -1.103134
C  0.882196 -3.468703 -0.274652
C  -5.767623 -0.463169 0.240191
C  -4.998488 1.308725 -1.171562
C  -6.00683 0.438922 -0.78683
H  4.755255 -0.564982 -0.749471
H  4.117254 1.502114 -1.969486
H  2.896502 0.239194 -2.001871
H  4.53528 1.944553 0.999915
H  5.616773 0.579813 1.30259
H  5.832704 1.573207 -0.135546
H  1.485571 2.623039 1.414587
H  0.789062 0.26781 -2.091691
H  -0.736482 1.959209 2.283412
H  -1.368115 -0.436519 -1.201068
H  1.418224 -1.22911 2.210987
H  -4.341133 -1.208061 1.66713
H  -2.986534 1.978028 -0.853338
H  -0.071992 -3.134994 1.628573
H  2.062819 -3.481175 -2.064358
H  0.25436 -4.296302 -0.571932
H  -6.545099 -1.147591 0.553491
H  -5.173659 2.022958 -1.965458
H  -6.969286 0.465468 -1.27921
totalener: -1054.05247519 hartree
nucrepener: 2011.95415969 hartree
electener: -3066.00663488 hartree
oneelecener: -5430.25955923 hartree
twoeener: 2364.25292435 hartree
kineticenergy: 1049.54459357 hartree
xcener: -102.375389358063 hartree
chargesum: -0.0000000
charge: -0.318258 -0.281167 -0.305611 -0.355493 0.157131 -0.030067 -0.260512 0.173746 -0.089274 -0.073869 0.258316 0.364515 -0.228465 -0.214155 0.276930 -0.202275 -0.233520 -0.171521 -0.075881 -0.015858 -0.138010 -0.085703 -0.123709 -0.152199 0.071927 0.099391 0.112456 0.094006 0.094217 0.073568 0.111946 0.113634 0.121129 0.127336 0.120425 0.118886 0.131049 0.129781 0.112760 0.122302 0.122501 0.124515 0.123081
qa: -0.3183 -0.2812 -0.3056 -0.3555 0.1571 -0.0301 -0.2605 0.1737 -0.0893 -0.0739 0.2583 0.3645 -0.2285 -0.2142 0.2769 -0.2023 -0.2335 -0.1715 -0.0759 -0.0159 -0.1380 -0.0857 -0.1237 -0.1522 0.0719 0.0994 0.1125 0.0940 0.0942 0.0736 0.1119 0.1136 0.1211 0.1273 0.1204 0.1189 0.1310 0.1298 0.1128 0.1223 0.1225 0.1245 0.1231
va: 2.0592 2.1179 2.0856 2.9818 3.7788 3.8684 3.9555 3.9241 3.9582 3.8080 3.7449 3.9788 4.0622 3.9360 3.7929 3.9304 4.0394 3.9225 3.9195 4.0804 3.8572 3.9379 3.9563 3.9647 1.0309 1.0058 1.0109 1.0121 1.0099 1.0083 1.0120 1.0087 1.0134 1.0074 1.0145 1.0172 1.0079 0.9981 1.0001 1.0022 0.9990 1.0005 1.0010
dispcorr: -0.023175214 hartree
energy: -1054.075650406793
dipole: 5.27309 -5.16943 0.10366 0.32229 -0.74308 -0.42079 -2.66414 2.37189 -0.29225
magnitude: 0.52270 au
magnitude: 1.32861 debye
