program: Orca
programVersion: 5.0.2
elementType: O O O N C C C C C C C C C C C C C C C C C C C C H H H H H H H H H H H H H H H H H H H
charge: 0
multiplicity: 1
keywords: wb97x-d3
keywords: def2-TZVPP
keywords: def2/J RIJCOSX
keywords: DEFGRID2
keywords: scfconv7
keywords: smallprint printgap noloewdin
keywords: NOSOSCF
formula: C20H19NO3
InChI: InChI=1/C20H19NO3/c1-16(23-20-9-5-6-14-21-20)15-22-17-10-12-19(13-11-17)24-18-7-3-2-4-8-18/h2-14,16H,15H2,1H3
43 atoms
O  2.578502 1.343376 0.633272
O  3.678738 -1.061644 -0.493826
O  -2.854314 2.142388 0.309887
N  1.469567 -1.520059 -0.051696
C  3.310047 0.04502 -1.310393
C  3.430938 1.319662 -0.483452
C  4.263355 0.078205 -2.488683
C  1.254892 1.55838 0.470896
C  0.659976 2.022189 -0.697117
C  0.45876 1.302736 1.585305
C  -1.497675 1.944885 0.35733
C  2.742401 -1.74654 0.174463
C  -0.714029 2.213898 -0.748731
C  -0.908284 1.490736 1.52866
C  -3.640443 1.162514 -0.209967
C  3.200414 -2.70661 1.084356
C  -5.001397 1.44462 -0.280544
C  -3.15971 -0.063798 -0.654524
C  2.257544 -3.435211 1.773608
C  0.571399 -2.227032 0.625999
C  0.903409 -3.196403 1.549607
C  -5.873853 0.501313 -0.792628
C  -4.050187 -0.99842 -1.166628
C  -5.405913 -0.727304 -1.240451
H  2.285147 -0.082762 -1.666724
H  4.442574 1.386757 -0.077987
H  3.289202 2.196596 -1.126489
H  4.198944 -0.845545 -3.061645
H  4.012232 0.900854 -3.158555
H  5.297957 0.206981 -2.167633
H  1.239867 2.237672 -1.583914
H  0.924886 0.939788 2.49167
H  -1.174098 2.570163 -1.661448
H  -1.523042 1.282654 2.394686
H  4.2605 -2.857038 1.233333
H  -5.362482 2.40331 0.068238
H  -2.103525 -0.294383 -0.612938
H  2.571648 -4.185223 2.487748
H  -0.467241 -1.995097 0.418123
H  0.135936 -3.74433 2.076912
H  -6.930181 0.730395 -0.844004
H  -3.668787 -1.950124 -1.513343
H  -6.09078 -1.461358 -1.642174
totalener: -1054.05383251 hartree
nucrepener: 1980.33568455 hartree
electener: -3034.38951705 hartree
oneelecener: -5366.87771402 hartree
twoeener: 2332.48819696 hartree
kineticenergy: 1049.53900540 hartree
xcener: -102.372973212953 hartree
chargesum: 0.0000000
charge: -0.296937 -0.294835 -0.303190 -0.352468 0.130074 -0.022815 -0.253224 0.317033 -0.155488 -0.221485 0.171650 0.407240 -0.167158 -0.117460 0.271664 -0.243509 -0.206724 -0.165946 -0.064544 0.023510 -0.162635 -0.093929 -0.151074 -0.146457 0.087479 0.112067 0.086885 0.096437 0.080035 0.087142 0.105321 0.116187 0.123667 0.122619 0.119557 0.119614 0.125661 0.128619 0.100935 0.122338 0.121598 0.120855 0.121693
qa: -0.2969 -0.2948 -0.3032 -0.3525 0.1301 -0.0228 -0.2532 0.3170 -0.1555 -0.2215 0.1717 0.4072 -0.1672 -0.1175 0.2717 -0.2435 -0.2067 -0.1659 -0.0645 0.0235 -0.1626 -0.0939 -0.1511 -0.1465 0.0875 0.1121 0.0869 0.0964 0.0800 0.0871 0.1053 0.1162 0.1237 0.1226 0.1196 0.1196 0.1257 0.1286 0.1009 0.1223 0.1216 0.1209 0.1217
va: 2.1043 2.1086 2.1051 2.9581 3.7837 3.9338 3.9605 3.7729 3.8596 3.9674 3.8664 3.9725 4.0519 3.9775 3.8189 3.9953 4.0252 3.9002 3.9277 4.0325 3.9177 3.9490 3.9856 3.9604 1.0326 1.0061 0.9972 1.0095 1.0072 1.0087 1.0107 1.0172 1.0079 1.0060 1.0140 1.0170 1.0105 0.9967 0.9989 1.0043 0.9989 1.0024 1.0010
dispcorr: -0.021560108 hartree
energy: -1054.075392616578
dipole: 5.40364 -4.72156 0.68208 -3.19279 2.73438 -0.45841 -6.74604 6.44788 -0.29816
magnitude: 0.87423 au
magnitude: 2.22210 debye
