program: Orca
programVersion: 5.0.2
elementType: O O O N C C C C C C C C C C C C C C C C C C C C H H H H H H H H H H H H H H H H H H H
charge: 0
multiplicity: 1
keywords: wb97x-d3
keywords: def2-TZVPP
keywords: def2/J RIJCOSX
keywords: DEFGRID2
keywords: scfconv7
keywords: smallprint printgap noloewdin
keywords: NOSOSCF
formula: C20H19NO3
InChI: InChI=1/C20H19NO3/c1-16(23-20-9-5-6-14-21-20)15-22-17-10-12-19(13-11-17)24-18-7-3-2-4-8-18/h2-14,16H,15H2,1H3
43 atoms
O  1.504209 0.064615 -0.124992
O  4.104019 -0.438652 0.753269
O  -3.929992 0.129286 0.71047
N  4.2589 -1.736791 -1.14016
C  3.777835 0.71194 -0.019421
C  2.347817 1.102583 0.299359
C  4.744597 1.821264 0.349676
C  0.179628 0.159894 0.105846
C  -0.439141 1.249125 0.711646
C  -0.597946 -0.921559 -0.304377
C  -2.579719 0.176214 0.488664
C  4.244619 -1.633751 0.168496
C  -1.813949 1.251029 0.905486
C  -1.967502 -0.909679 -0.121439
C  -4.723386 1.120847 0.220769
C  4.401004 -2.730357 1.024725
C  -5.9142 1.356031 0.897423
C  -4.408816 1.854988 -0.917207
C  4.574173 -3.97037 0.453214
C  4.422275 -2.941817 -1.676675
C  4.585331 -4.092946 -0.934355
C  -6.789083 2.323599 0.432817
C  -5.293349 2.8245 -1.366505
C  -6.483155 3.067516 -0.698049
H  3.861583 0.482147 -1.083267
H  2.24472 1.28205 1.377924
H  2.109641 2.041372 -0.21866
H  5.768451 1.52757 0.123052
H  4.526526 2.724591 -0.220661
H  4.690381 2.068062 1.41083
H  0.128427 2.106145 1.046936
H  -0.114824 -1.768652 -0.773309
H  -2.283509 2.100222 1.385584
H  -2.567525 -1.750516 -0.44386
H  4.381372 -2.592172 2.09668
H  -6.145891 0.776065 1.78112
H  -3.487228 1.672984 -1.454367
H  4.697616 -4.842046 1.082538
H  4.424857 -2.979903 -2.760199
H  4.716563 -5.049811 -1.418547
H  -7.714002 2.501388 0.965665
H  -5.045166 3.39208 -2.253886
H  -7.165822 3.826435 -1.055146
totalener: -1054.05607284 hartree
nucrepener: 1852.13234532 hartree
electener: -2906.18841816 hartree
oneelecener: -5110.45188540 hartree
twoeener: 2204.26346724 hartree
kineticenergy: 1049.52799407 hartree
xcener: -102.368203057195 hartree
chargesum: 0.0000000
charge: -0.274453 -0.302101 -0.303274 -0.345674 0.158171 0.009091 -0.261792 0.282777 -0.156404 -0.196737 0.175782 0.414566 -0.186599 -0.144508 0.236691 -0.243231 -0.206123 -0.149451 -0.066130 -0.003240 -0.159307 -0.094782 -0.130139 -0.147661 0.083335 0.083495 0.080827 0.096663 0.080346 0.085157 0.106777 0.122536 0.129935 0.124315 0.119575 0.122778 0.129202 0.128639 0.110130 0.121712 0.122512 0.124099 0.122497
qa: -0.2745 -0.3021 -0.3033 -0.3457 0.1582 0.0091 -0.2618 0.2828 -0.1564 -0.1967 0.1758 0.4146 -0.1866 -0.1445 0.2367 -0.2432 -0.2061 -0.1495 -0.0661 -0.0032 -0.1593 -0.0948 -0.1301 -0.1477 0.0833 0.0835 0.0808 0.0967 0.0803 0.0852 0.1068 0.1225 0.1299 0.1243 0.1196 0.1228 0.1292 0.1286 0.1101 0.1217 0.1225 0.1241 0.1225
va: 2.1348 2.1200 2.0946 3.0110 3.8421 3.9023 3.9620 3.8841 3.8846 4.0010 3.8784 3.9540 4.0528 4.0067 3.8228 3.9873 4.0173 3.9066 3.9248 4.0892 3.8728 3.9446 3.9637 3.9570 1.0514 0.9966 0.9924 1.0094 1.0078 1.0078 1.0188 1.0126 1.0050 1.0102 1.0144 1.0147 1.0067 0.9975 0.9987 1.0037 0.9989 1.0004 1.0008
dispcorr: -0.017502629 hartree
energy: -1054.073575467026
dipole: 6.60078 -6.00774 0.59304 6.97419 -6.67719 0.29700 -0.66600 0.70344 0.03743
magnitude: 0.66431 au
magnitude: 1.68855 debye
