program: Orca
programVersion: 5.0.2
elementType: O O O N C C C C C C C C C C C C C C C C C C C C H H H H H H H H H H H H H H H H H H H
charge: 0
multiplicity: 1
keywords: wb97x-d3
keywords: def2-TZVPP
keywords: def2/J RIJCOSX
keywords: DEFGRID2
keywords: scfconv7
keywords: smallprint printgap noloewdin
keywords: NOSOSCF
formula: C20H19NO3
InChI: InChI=1/C20H19NO3/c1-16(23-20-9-5-6-14-21-20)15-22-17-10-12-19(13-11-17)24-18-7-3-2-4-8-18/h2-14,16H,15H2,1H3
43 atoms
O  0.998478 -0.546523 -0.213563
O  3.730872 -0.544091 0.269139
O  -4.058383 1.200462 1.053633
N  5.037525 -2.337337 -0.31315
C  3.214919 -0.495731 -1.056077
C  1.893332 0.235256 -0.960324
C  4.166903 0.232503 -1.989115
C  -0.230209 -0.05459 0.043701
C  -1.070629 -0.858126 0.811999
C  -0.695478 1.178158 -0.404139
C  -2.807711 0.792788 0.676769
C  4.613757 -1.488827 0.596927
C  -2.351615 -0.441322 1.118908
C  -1.977769 1.599868 -0.081094
C  -4.943787 1.609058 0.10366
C  5.045034 -1.512151 1.928686
C  -4.947244 1.107871 -1.192701
C  -5.895994 2.541551 0.495501
C  5.960462 -2.474263 2.288042
C  5.918266 -3.264532 0.053242
C  6.416719 -3.381044 1.333343
C  -5.90592 1.551803 -2.090878
C  -6.850613 2.970602 -0.411806
C  -6.859578 2.483312 -1.710292
H  3.045011 -1.510393 -1.426481
H  2.048303 1.217362 -0.494669
H  1.512105 0.406556 -1.975486
H  5.12312 -0.283307 -2.042389
H  3.756036 0.268622 -2.998763
H  4.343753 1.256764 -1.657539
H  -0.708708 -1.816164 1.161238
H  -0.07602 1.833147 -1.000691
H  -3.001682 -1.070053 1.713159
H  -2.324057 2.565601 -0.426701
H  4.659978 -0.793617 2.638371
H  -4.213301 0.37537 -1.501685
H  -5.881591 2.922039 1.50803
H  6.319039 -2.52442 3.307694
H  6.239672 -3.943897 -0.727785
H  7.135355 -4.14935 1.579024
H  -5.906281 1.15669 -3.09795
H  -7.588929 3.697715 -0.100532
H  -7.603311 2.824436 -2.417368
totalener: -1054.05766665 hartree
nucrepener: 1820.51464814 hartree
electener: -2874.57231479 hartree
oneelecener: -5047.09030278 hartree
twoeener: 2172.51798800 hartree
kineticenergy: 1049.54696190 hartree
xcener: -102.371778635237 hartree
chargesum: -0.0000000
charge: -0.276115 -0.283950 -0.303418 -0.370951 0.145518 0.050223 -0.286137 0.285828 -0.195681 -0.154644 0.181059 0.414861 -0.148728 -0.190870 0.234777 -0.238233 -0.148724 -0.207466 -0.068392 -0.005437 -0.154414 -0.128134 -0.093703 -0.147394 0.067014 0.084957 0.079493 0.103493 0.083819 0.085238 0.119614 0.104793 0.122759 0.130340 0.123551 0.128955 0.123187 0.129560 0.111208 0.122164 0.124430 0.122639 0.122913
qa: -0.2761 -0.2840 -0.3034 -0.3710 0.1455 0.0502 -0.2861 0.2858 -0.1957 -0.1546 0.1811 0.4149 -0.1487 -0.1909 0.2348 -0.2382 -0.1487 -0.2075 -0.0684 -0.0054 -0.1544 -0.1281 -0.0937 -0.1474 0.0670 0.0850 0.0795 0.1035 0.0838 0.0852 0.1196 0.1048 0.1228 0.1303 0.1236 0.1290 0.1232 0.1296 0.1112 0.1222 0.1244 0.1226 0.1229
va: 2.1254 2.1372 2.0950 2.9917 3.8683 3.8496 3.9381 3.8796 4.0158 3.8652 3.8765 3.9409 4.0147 4.0463 3.8258 3.9968 3.9093 4.0216 3.9233 4.0940 3.8776 3.9600 3.9429 3.9572 1.0414 0.9985 0.9931 1.0199 1.0102 1.0069 1.0153 1.0206 1.0107 1.0050 1.0131 1.0066 1.0147 0.9974 0.9996 1.0034 1.0003 0.9989 1.0008
dispcorr: -0.017026300 hartree
energy: -1054.074692950835
dipole: 6.46516 -5.74044 0.72472 2.30020 -2.20138 0.09882 -7.45275 7.11548 -0.33727
magnitude: 0.80544 au
magnitude: 2.04727 debye
