program: Orca
programVersion: 5.0.2
elementType: O O O N C C C C C C C C C C C C C C C C C C C C H H H H H H H H H H H H H H H H H H H
charge: 0
multiplicity: 1
keywords: wb97x-d3
keywords: def2-TZVPP
keywords: def2/J RIJCOSX
keywords: DEFGRID2
keywords: scfconv7
keywords: smallprint printgap noloewdin
keywords: NOSOSCF
formula: C20H19NO3
InChI: InChI=1/C20H19NO3/c1-16(23-20-9-5-6-14-21-20)15-22-17-10-12-19(13-11-17)24-18-7-3-2-4-8-18/h2-14,16H,15H2,1H3
43 atoms
O  1.831062 0.870235 0.406982
O  3.844564 -1.056317 0.844237
O  -3.305287 2.53226 -0.629489
N  3.807755 -2.382916 -1.028707
C  4.041718 0.093667 0.027509
C  2.738256 0.539219 -0.613653
C  4.658372 1.155792 0.91793
C  0.586965 1.266235 0.079144
C  -0.266498 1.545224 1.147918
C  0.116465 1.412029 -1.220443
C  -2.033755 2.088208 -0.380645
C  3.715687 -2.257249 0.277108
C  -1.563007 1.956657 0.922107
C  -1.196515 1.814883 -1.443453
C  -4.359631 1.808718 -0.16263
C  3.492112 -3.339331 1.137814
C  -4.292581 0.443317 0.089876
C  -5.551198 2.497846 0.030092
C  3.36728 -4.588983 0.576016
C  3.688996 -3.599615 -1.554434
C  3.468334 -4.736118 -0.806201
C  -5.42374 -0.221053 0.541209
C  -6.672524 1.818759 0.476017
C  -6.6160 0.457204 0.739158
H  4.727776 -0.145451 -0.79078
H  2.948884 1.406472 -1.254783
H  2.3438 -0.256589 -1.254292
H  4.008021 1.411873 1.752389
H  5.612874 0.815064 1.317249
H  4.843725 2.06278 0.341997
H  0.105192 1.438239 2.158466
H  0.747799 1.211054 -2.074851
H  -2.213389 2.176141 1.759246
H  -1.56377 1.922176 -2.455687
H  3.420567 -3.180384 2.204626
H  -3.37087 -0.102157 -0.063708
H  -5.589169 3.560292 -0.17177
H  3.194223 -5.449974 1.208236
H  3.770104 -3.657173 -2.633934
H  3.375298 -5.701564 -1.281884
H  -5.365776 -1.283915 0.736253
H  -7.596311 2.362093 0.625851
H  -7.492052 -0.068472 1.093738
totalener: -1054.05745066 hartree
nucrepener: 1856.95353290 hartree
electener: -2911.01098356 hartree
oneelecener: -5120.02939065 hartree
twoeener: 2209.01840709 hartree
kineticenergy: 1049.53133007 hartree
xcener: -102.369318390608 hartree
chargesum: -0.0000000
charge: -0.288473 -0.288167 -0.302930 -0.380354 0.186387 -0.046639 -0.261655 0.299713 -0.211671 -0.152037 0.182921 0.408921 -0.112661 -0.221242 0.235774 -0.231872 -0.149304 -0.203931 -0.069333 -0.008273 -0.152287 -0.133062 -0.095200 -0.147546 0.069275 0.098151 0.115521 0.098175 0.092826 0.074205 0.120530 0.109431 0.130836 0.123624 0.124585 0.129549 0.122435 0.129953 0.111585 0.123244 0.124137 0.122116 0.122743
qa: -0.2885 -0.2882 -0.3029 -0.3804 0.1864 -0.0466 -0.2617 0.2997 -0.2117 -0.1520 0.1829 0.4089 -0.1127 -0.2212 0.2358 -0.2319 -0.1493 -0.2039 -0.0693 -0.0083 -0.1523 -0.1331 -0.0952 -0.1475 0.0693 0.0982 0.1155 0.0982 0.0928 0.0742 0.1205 0.1094 0.1308 0.1236 0.1246 0.1295 0.1224 0.1300 0.1116 0.1232 0.1241 0.1221 0.1227
va: 2.1018 2.1528 2.0934 2.9823 3.8474 3.8219 3.9437 3.8559 4.0212 3.8710 3.8749 3.9416 3.9693 4.0936 3.8229 3.9897 3.9038 4.0164 3.9228 4.0942 3.8784 3.9691 3.9475 3.9572 1.0367 0.9923 1.0051 1.0159 1.0098 1.0084 1.0154 1.0177 1.0018 1.0142 1.0132 1.0068 1.0149 0.9977 0.9996 1.0031 1.0005 0.9990 1.0007
dispcorr: -0.017568097 hartree
energy: -1054.075018761581
dipole: 5.60287 -5.06350 0.53937 -1.61865 0.91975 -0.69890 0.80330 -0.85552 -0.05222
magnitude: 0.88437 au
magnitude: 2.24789 debye
