program: Orca
programVersion: 5.0.2
elementType: O O O N C C C C C C C C C C C C C C C C C C C C H H H H H H H H H H H H H H H H H H H
charge: 0
multiplicity: 1
keywords: wb97x-d3
keywords: def2-TZVPP
keywords: def2/J RIJCOSX
keywords: DEFGRID2
keywords: scfconv7
keywords: smallprint printgap noloewdin
keywords: NOSOSCF
formula: C20H19NO3
InChI: InChI=1/C20H19NO3/c1-16(23-20-9-5-6-14-21-20)15-22-17-10-12-19(13-11-17)24-18-7-3-2-4-8-18/h2-14,16H,15H2,1H3
43 atoms
O  1.625652 0.630377 0.394492
O  3.897902 -1.015172 0.987061
O  -3.420251 2.255635 -1.065211
N  4.160431 -2.381326 -0.838862
C  3.937096 0.125285 0.134419
C  2.607807 0.338145 -0.567913
C  4.344309 1.300451 1.001927
C  0.395022 0.988359 -0.021517
C  -0.481621 1.444427 0.963706
C  -0.04028 0.936117 -1.340541
C  -2.189648 1.795827 -0.685009
C  4.01505 -2.235882 0.460201
C  -1.759299 1.850893 0.637257
C  -1.333073 1.331779 -1.663973
C  -4.534995 1.848103 -0.399313
C  3.983471 -3.314113 1.353927
C  -5.59048 2.749716 -0.340394
C  -4.660774 0.583872 0.1656
C  4.117317 -4.580628 0.833093
C  4.289811 -3.613415 -1.324774
C  4.277077 -4.747712 -0.541385
C  -6.77208 2.384261 0.283117
C  -5.848105 0.235307 0.792689
C  -6.906886 1.128404 0.857981
H  4.681969 -0.028046 -0.652328
H  2.725321 1.172382 -1.273506
H  2.345185 -0.550524 -1.151316
H  3.645144 1.459411 1.820681
H  5.336365 1.140047 1.422369
H  4.379011 2.212045 0.404762
H  -0.140796 1.490377 1.989802
H  0.604709 0.584728 -2.13384
H  -2.419522 2.218044 1.412598
H  -1.669693 1.28908 -2.691427
H  3.857769 -3.140224 2.41337
H  -5.477325 3.729416 -0.786101
H  -3.845077 -0.125775 0.115781
H  4.098403 -5.439561 1.491137
H  4.406806 -3.68693 -2.400059
H  4.384345 -5.72689 -0.985076
H  -7.59016 3.091486 0.326049
H  -5.943398 -0.750264 1.229823
H  -7.828876 0.847751 1.348643
totalener: -1054.05736712 hartree
nucrepener: 1841.93512095 hartree
electener: -2895.99248807 hartree
oneelecener: -5090.00918718 hartree
twoeener: 2194.01669911 hartree
kineticenergy: 1049.52647260 hartree
xcener: -102.368780034951 hartree
chargesum: 0.0000000
charge: -0.289852 -0.289776 -0.302640 -0.380560 0.189802 -0.041833 -0.262603 0.286871 -0.204509 -0.141597 0.204330 0.412418 -0.123059 -0.239742 0.243576 -0.235006 -0.212428 -0.159718 -0.068601 -0.009007 -0.153083 -0.091936 -0.122427 -0.149450 0.068171 0.099481 0.109154 0.097087 0.092691 0.075753 0.119647 0.109424 0.131493 0.122992 0.124659 0.123277 0.131352 0.129879 0.111535 0.123275 0.122798 0.124862 0.123301
qa: -0.2899 -0.2898 -0.3026 -0.3806 0.1898 -0.0418 -0.2626 0.2869 -0.2045 -0.1416 0.2043 0.4124 -0.1231 -0.2397 0.2436 -0.2350 -0.2124 -0.1597 -0.0686 -0.0090 -0.1531 -0.0919 -0.1224 -0.1495 0.0682 0.0995 0.1092 0.0971 0.0927 0.0758 0.1196 0.1094 0.1315 0.1230 0.1247 0.1233 0.1314 0.1299 0.1115 0.1233 0.1228 0.1249 0.1233
va: 2.0992 2.1524 2.0946 2.9767 3.8415 3.8300 3.9454 3.8702 4.0220 3.8692 3.8550 3.9371 3.9550 4.0987 3.8158 3.9915 4.0261 3.9224 3.9218 4.0962 3.8795 3.9396 3.9572 3.9604 1.0382 0.9933 1.0047 1.0165 1.0092 1.0079 1.0154 1.0170 1.0018 1.0157 1.0133 1.0149 1.0054 0.9977 0.9996 1.0031 0.9989 1.0003 1.0007
dispcorr: -0.017420243 hartree
energy: -1054.074787363072
dipole: 5.28179 -4.74878 0.53301 -0.35020 -0.25303 -0.60323 1.64907 -1.59827 0.05081
magnitude: 0.80657 au
magnitude: 2.05014 debye
