program: Orca
programVersion: 5.0.2
elementType: O O O N C C C C C C C C C C C C C C C C C C C C H H H H H H H H H H H H H H H H H H H
charge: 0
multiplicity: 1
keywords: wb97x-d3
keywords: def2-TZVPP
keywords: def2/J RIJCOSX
keywords: DEFGRID2
keywords: scfconv7
keywords: smallprint printgap noloewdin
keywords: NOSOSCF
formula: C20H19NO3
InChI: InChI=1/C20H19NO3/c1-16(23-20-9-5-6-14-21-20)15-22-17-10-12-19(13-11-17)24-18-7-3-2-4-8-18/h2-14,16H,15H2,1H3
43 atoms
O  1.770281 0.797597 0.5256
O  3.879676 -1.051891 0.902029
O  -3.322997 2.595309 -0.505787
N  3.894706 -2.325946 -1.00826
C  4.016582 0.129908 0.12014
C  2.692617 0.537751 -0.502926
C  4.58974 1.190822 1.040345
C  0.532726 1.218096 0.200769
C  0.087004 1.4407 -1.097098
C  -0.339531 1.442625 1.267398
C  -2.067968 2.104588 -0.259394
C  3.811368 -2.241744 0.301428
C  -1.214822 1.87683 -1.320355
C  -1.626524 1.885343 1.041509
C  -4.409905 1.841346 -0.187492
C  3.656326 -3.357482 1.133837
C  -4.359436 0.465772 0.00459
C  -5.621087 2.517193 -0.085671
C  3.59571 -4.59658 0.539311
C  3.83614 -3.532939 -1.566137
C  3.689593 -4.699971 -0.84742
C  -5.52734 -0.22251 0.301861
C  -6.777075 1.814724 0.207249
C  -6.73888 0.441422 0.406793
H  4.706806 -0.051662 -0.709546
H  2.867952 1.433699 -1.114209
H  2.330291 -0.251462 -1.170296
H  4.711952 2.128598 0.497965
H  3.941906 1.376155 1.895209
H  5.569606 0.889948 1.409225
H  0.730027 1.27744 -1.950671
H  0.010089 1.271633 2.277046
H  -1.560271 2.048997 -2.331318
H  -2.290759 2.064735 1.877319
H  3.588044 -3.231263 2.205215
H  -3.423826 -0.07101 -0.078757
H  -5.645957 3.588113 -0.239156
H  3.478239 -5.482937 1.148867
H  3.912013 -3.557376 -2.647295
H  3.646693 -5.655933 -1.34886
H  -5.482252 -1.293755 0.448501
H  -7.715435 2.34815 0.285173
H  -7.643574 -0.103302 0.639785
totalener: -1054.05762819 hartree
nucrepener: 1851.90826046 hartree
electener: -2905.96588865 hartree
oneelecener: -5109.91777920 hartree
twoeener: 2203.95189055 hartree
kineticenergy: 1049.52489525 hartree
xcener: -102.368154814666 hartree
chargesum: 0.0000000
charge: -0.288131 -0.288628 -0.301671 -0.380162 0.186509 -0.046585 -0.261344 0.302310 -0.154158 -0.211563 0.182776 0.409727 -0.216469 -0.116816 0.251956 -0.232547 -0.159815 -0.210483 -0.069074 -0.008237 -0.152335 -0.132307 -0.091860 -0.151437 0.069667 0.096462 0.117130 0.074156 0.098016 0.092958 0.109517 0.120750 0.123276 0.130650 0.124371 0.128637 0.121659 0.130000 0.111647 0.123128 0.124026 0.121915 0.122383
qa: -0.2881 -0.2886 -0.3017 -0.3802 0.1865 -0.0466 -0.2613 0.3023 -0.1542 -0.2116 0.1828 0.4097 -0.2165 -0.1168 0.2520 -0.2325 -0.1598 -0.2105 -0.0691 -0.0082 -0.1523 -0.1323 -0.0919 -0.1514 0.0697 0.0965 0.1171 0.0742 0.0980 0.0930 0.1095 0.1207 0.1233 0.1307 0.1244 0.1286 0.1217 0.1300 0.1116 0.1231 0.1240 0.1219 0.1224
va: 2.1036 2.1515 2.0965 2.9827 3.8475 3.8223 3.9431 3.8529 3.8671 4.0180 3.8750 3.9410 4.0948 3.9775 3.8151 3.9902 3.9080 4.0201 3.9229 4.0946 3.8788 3.9699 3.9462 3.9616 1.0364 0.9919 1.0052 1.0084 1.0159 1.0096 1.0180 1.0153 1.0140 1.0020 1.0133 1.0083 1.0155 0.9977 0.9996 1.0031 1.0005 0.9989 1.0009
dispcorr: -0.017495727 hartree
energy: -1054.075123912736
dipole: 5.46796 -4.87993 0.58803 -1.54162 0.85013 -0.69150 0.47167 -0.56694 -0.09526
magnitude: 0.91270 au
magnitude: 2.31990 debye
