program: Orca
programVersion: 5.0.2
elementType: O O O N C C C C C C C C C C C C C C C C C C C C H H H H H H H H H H H H H H H H H H H
charge: 0
multiplicity: 1
keywords: wb97x-d3
keywords: def2-TZVPP
keywords: def2/J RIJCOSX
keywords: DEFGRID2
keywords: scfconv7
keywords: smallprint printgap noloewdin
keywords: NOSOSCF
formula: C20H19NO3
InChI: InChI=1/C20H19NO3/c1-16(23-20-9-5-6-14-21-20)15-22-17-10-12-19(13-11-17)24-18-7-3-2-4-8-18/h2-14,16H,15H2,1H3
43 atoms
O  2.4969 1.927615 0.131745
O  2.550968 -0.893173 1.074342
O  -2.798987 1.35215 -1.251491
N  3.285578 -2.058255 -0.761273
C  3.684512 -0.032865 0.977358
C  3.522028 0.999754 -0.131869
C  3.853141 0.601003 2.34447
C  1.216094 1.687862 -0.227352
C  0.268119 2.537192 0.343936
C  0.796146 0.720497 -1.132651
C  -1.482843 1.450983 -0.880298
C  2.403497 -1.891244 0.20053
C  -1.06925 2.424319 0.019689
C  -0.552016 0.601265 -1.445962
C  -3.711061 0.895255 -0.352961
C  1.281691 -2.713127 0.365124
C  -3.37168 0.231605 0.820341
C  -5.048707 1.104959 -0.674104
C  1.112223 -3.749148 -0.524082
C  3.106304 -3.067051 -1.612058
C  2.043918 -3.942278 -1.543402
C  -4.379031 -0.214449 1.665093
C  -6.039731 0.651109 0.178069
C  -5.713553 -0.009757 1.354994
H  4.573846 -0.621936 0.729582
H  4.44506 1.582542 -0.179585
H  3.412155 0.511152 -1.10231
H  4.025989 -0.161105 3.103392
H  4.712563 1.27164 2.343155
H  2.976299 1.179234 2.631963
H  0.59654 3.295409 1.042748
H  1.490731 0.044503 -1.610857
H  -1.793003 3.095245 0.464923
H  -0.874699 -0.156816 -2.147511
H  0.581566 -2.52348 1.166287
H  -2.335339 0.059159 1.078651
H  -5.299009 1.622675 -1.590962
H  0.257226 -4.405866 -0.430706
H  3.858251 -3.169633 -2.386178
H  1.941477 -4.744461 -2.2598
H  -4.108648 -0.730553 2.577213
H  -7.077242 0.820043 -0.079403
H  -6.490877 -0.359433 2.020552
totalener: -1054.05511109 hartree
nucrepener: 1957.91213396 hartree
electener: -3011.96724505 hartree
oneelecener: -5321.93752384 hartree
twoeener: 2309.97027879 hartree
kineticenergy: 1049.52591114 hartree
xcener: -102.370411354492 hartree
chargesum: 0.0000000
charge: -0.303801 -0.283792 -0.301929 -0.360819 0.181984 -0.054878 -0.259045 0.295419 -0.193512 -0.153245 0.186668 0.356167 -0.120886 -0.200674 0.261279 -0.214270 -0.163024 -0.213187 -0.068345 -0.012629 -0.143110 -0.136904 -0.091184 -0.152215 0.071513 0.110590 0.117339 0.093218 0.077447 0.095790 0.116028 0.109002 0.128018 0.120796 0.121985 0.126050 0.121547 0.132324 0.113615 0.124496 0.122747 0.121561 0.121867
qa: -0.3038 -0.2838 -0.3019 -0.3608 0.1820 -0.0549 -0.2590 0.2954 -0.1935 -0.1532 0.1867 0.3562 -0.1209 -0.2007 0.2613 -0.2143 -0.1630 -0.2132 -0.0683 -0.0126 -0.1431 -0.1369 -0.0912 -0.1522 0.0715 0.1106 0.1173 0.0932 0.0774 0.0958 0.1160 0.1090 0.1280 0.1208 0.1220 0.1260 0.1215 0.1323 0.1136 0.1245 0.1227 0.1216 0.1219
va: 2.0829 2.1215 2.0973 2.9529 3.7564 3.8801 3.9581 3.8614 4.0096 3.8432 3.8555 3.9525 3.9936 4.0651 3.8151 3.9605 3.9030 4.0233 3.9262 4.0844 3.8704 3.9718 3.9453 3.9627 1.0387 1.0019 1.0076 1.0095 1.0071 1.0129 1.0171 1.0196 1.0027 1.0144 1.0143 1.0110 1.0161 0.9966 0.9999 1.0025 1.0007 0.9989 1.0010
dispcorr: -0.020670934 hartree
energy: -1054.075782025516
dipole: 5.20453 -4.65438 0.55015 -2.34296 1.60019 -0.74277 5.53703 -5.35944 0.17759
magnitude: 0.94123 au
magnitude: 2.39241 debye
