program: Orca
programVersion: 5.0.2
elementType: O O O N C C C C C C C C C C C C C C C C C C C C H H H H H H H H H H H H H H H H H H H
charge: 0
multiplicity: 1
keywords: wb97x-d3
keywords: def2-TZVPP
keywords: def2/J RIJCOSX
keywords: DEFGRID2
keywords: scfconv7
keywords: smallprint printgap noloewdin
keywords: NOSOSCF
formula: C20H19NO3
InChI: InChI=1/C20H19NO3/c1-16(23-20-9-5-6-14-21-20)15-22-17-10-12-19(13-11-17)24-18-7-3-2-4-8-18/h2-14,16H,15H2,1H3
43 atoms
O  1.632876 1.234915 0.887887
O  3.77892 -0.573912 0.556821
O  -3.497424 0.262525 -0.849039
N  3.67952 -2.488029 -0.704282
C  3.301486 0.1742 -0.555961
C  2.722991 1.452695 0.029669
C  4.423625 0.494224 -1.528939
C  0.405153 0.993583 0.382367
C  -0.587875 0.710081 1.321695
C  0.0677 1.026214 -0.965734
C  -2.223417 0.529674 -0.423933
C  3.936207 -1.89446 0.440011
C  -1.88816 0.476413 0.924818
C  -1.247436 0.804307 -1.36068
C  -4.519316 1.060704 -0.436199
C  4.378221 -2.579669 1.578588
C  -4.339533 2.358042 0.03005
C  -5.798565 0.523877 -0.530455
C  4.546257 -3.941726 1.480019
C  3.842701 -3.806065 -0.78017
C  4.273974 -4.583884 0.273583
C  -5.447202 3.106416 0.402937
C  -6.892966 1.285714 -0.158929
C  -6.725854 2.57994 0.314655
H  2.526467 -0.398115 -1.074527
H  3.482845 1.946415 0.639054
H  2.469338 2.144593 -0.782007
H  4.853444 -0.418204 -1.936747
H  4.045242 1.081829 -2.366766
H  5.217453 1.066735 -1.046569
H  -0.321671 0.671563 2.369738
H  0.802705 1.229423 -1.732181
H  -2.645933 0.251954 1.664754
H  -1.507497 0.83674 -2.410534
H  4.573249 -2.04309 2.496521
H  -3.34974 2.789028 0.100829
H  -5.924024 -0.486757 -0.896458
H  4.886765 -4.506833 2.337843
H  3.616077 -4.254756 -1.740671
H  4.394392 -5.651443 0.159739
H  -5.300897 4.116062 0.76405
H  -7.884887 0.859854 -0.235117
H  -7.582639 3.170513 0.608989
totalener: -1054.05574217 hartree
nucrepener: 1861.18643911 hartree
electener: -2915.24218128 hartree
oneelecener: -5128.47651249 hartree
twoeener: 2213.23433121 hartree
kineticenergy: 1049.52434722 hartree
xcener: -102.368638650700 hartree
chargesum: 0.0000000
charge: -0.286988 -0.286768 -0.301820 -0.374417 0.142307 0.011394 -0.284910 0.295818 -0.203310 -0.151422 0.184244 0.418885 -0.121284 -0.215402 0.253160 -0.235835 -0.160381 -0.212215 -0.069597 -0.007559 -0.151686 -0.132281 -0.091319 -0.151050 0.072109 0.112767 0.083121 0.105280 0.083332 0.088458 0.120698 0.106364 0.130521 0.123132 0.123061 0.128660 0.122520 0.129598 0.111198 0.122541 0.124203 0.122327 0.122544
qa: -0.2870 -0.2868 -0.3018 -0.3744 0.1423 0.0114 -0.2849 0.2958 -0.2033 -0.1514 0.1842 0.4189 -0.1213 -0.2154 0.2532 -0.2358 -0.1604 -0.2122 -0.0696 -0.0076 -0.1517 -0.1323 -0.0913 -0.1510 0.0721 0.1128 0.0831 0.1053 0.0833 0.0885 0.1207 0.1064 0.1305 0.1231 0.1231 0.1287 0.1225 0.1296 0.1112 0.1225 0.1242 0.1223 0.1225
va: 2.1219 2.1298 2.0965 2.9855 3.7392 3.9131 3.9494 3.8379 4.0302 3.8394 3.8748 3.9240 3.9803 4.0958 3.8125 3.9943 3.9102 4.0211 3.9240 4.0983 3.8757 3.9699 3.9443 3.9611 1.0437 1.0085 0.9996 1.0178 1.0097 1.0073 1.0165 1.0128 1.0014 1.0146 1.0134 1.0078 1.0153 0.9976 0.9992 1.0032 1.0004 0.9988 1.0009
dispcorr: -0.017950416 hartree
energy: -1054.073692586654
dipole: 6.27257 -5.53641 0.73616 2.72384 -2.76407 -0.04023 -2.98561 3.00447 0.01886
magnitude: 0.73750 au
magnitude: 1.87458 debye
