program: Orca
programVersion: 5.0.2
elementType: O O O N C C C C C C C C C C C C C C C C C C C C H H H H H H H H H H H H H H H H H H H
charge: 0
multiplicity: 1
keywords: wb97x-d3
keywords: def2-TZVPP
keywords: def2/J RIJCOSX
keywords: DEFGRID2
keywords: scfconv7
keywords: smallprint printgap noloewdin
keywords: NOSOSCF
formula: C20H19NO3
InChI: InChI=1/C20H19NO3/c1-16(23-20-9-5-6-14-21-20)15-22-17-10-12-19(13-11-17)24-18-7-3-2-4-8-18/h2-14,16H,15H2,1H3
43 atoms
O  2.336139 1.701444 0.477369
O  3.577174 -0.822669 0.104525
O  -3.11841 2.426106 0.436217
N  2.35299 -2.688284 -0.429796
C  2.996233 -0.134146 -0.998448
C  3.090353 1.344074 -0.653101
C  3.739477 -0.440369 -2.286409
C  0.996072 1.834529 0.379458
C  0.319059 2.078394 1.572844
C  0.268274 1.767893 -0.805503
C  -1.770426 2.192212 0.397828
C  3.206444 -2.078722 0.362695
C  -1.0523 2.249213 1.583455
C  -1.106956 1.954915 -0.7932
C  -3.977974 1.50143 -0.072054
C  3.768705 -2.681297 1.494887
C  -3.672113 0.149203 -0.175308
C  -5.227667 1.966957 -0.464355
C  3.393271 -3.972773 1.785079
C  1.997619 -3.935072 -0.131486
C  2.482097 -4.627138 0.958192
C  -4.623489 -0.726561 -0.677979
C  -6.167882 1.078688 -0.958503
C  -5.871527 -0.272151 -1.074006
H  1.95108 -0.437256 -1.107834
H  4.12467 1.593892 -0.408508
H  2.819116 1.944407 -1.52943
H  4.788235 -0.146466 -2.221991
H  3.691546 -1.503398 -2.51463
H  3.288647 0.095055 -3.123271
H  0.882252 2.127682 2.495396
H  0.745984 1.581567 -1.757232
H  -1.570832 2.435115 2.514856
H  -1.6581 1.910139 -1.723918
H  4.467113 -2.134766 2.113001
H  -2.705654 -0.224643 0.135847
H  -5.452598 3.021827 -0.37657
H  3.803211 -4.471957 2.653288
H  1.290843 -4.399278 -0.809835
H  2.163536 -5.640371 1.155893
H  -4.380609 -1.778314 -0.754864
H  -7.138189 1.449116 -1.262293
H  -6.606419 -0.962317 -1.465138
totalener: -1054.05569821 hartree
nucrepener: 1893.32367176 hartree
electener: -2947.37936997 hartree
oneelecener: -5192.70311690 hartree
twoeener: 2245.32374693 hartree
kineticenergy: 1049.52843753 hartree
xcener: -102.369578609562 hartree
chargesum: -0.0000000
charge: -0.288733 -0.287622 -0.302907 -0.373724 0.131126 0.018598 -0.282908 0.295294 -0.193221 -0.163545 0.183783 0.419745 -0.148554 -0.186896 0.250804 -0.235746 -0.159536 -0.213539 -0.068335 -0.010156 -0.151227 -0.128983 -0.091222 -0.150795 0.076236 0.112321 0.084163 0.089390 0.104456 0.082427 0.119054 0.106977 0.122943 0.131183 0.122736 0.131638 0.122584 0.129325 0.110983 0.122876 0.124390 0.122131 0.122485
qa: -0.2887 -0.2876 -0.3029 -0.3737 0.1311 0.0186 -0.2829 0.2953 -0.1932 -0.1635 0.1838 0.4197 -0.1486 -0.1869 0.2508 -0.2357 -0.1595 -0.2135 -0.0683 -0.0102 -0.1512 -0.1290 -0.0912 -0.1508 0.0762 0.1123 0.0842 0.0894 0.1045 0.0824 0.1191 0.1070 0.1229 0.1312 0.1227 0.1316 0.1226 0.1293 0.1110 0.1229 0.1244 0.1221 0.1225
va: 2.1214 2.1275 2.0986 2.9868 3.7421 3.9078 3.9556 3.8286 4.0271 3.8515 3.8751 3.9235 4.0288 4.0384 3.8143 3.9954 3.9106 4.0239 3.9244 4.1005 3.8749 3.9626 3.9416 3.9600 1.0441 1.0090 0.9990 1.0071 1.0166 1.0096 1.0157 1.0134 1.0101 1.0043 1.0136 1.0065 1.0151 0.9977 0.9991 1.0033 1.0004 0.9989 1.0010
dispcorr: -0.018166604 hartree
energy: -1054.073864818300
dipole: 4.52543 -3.97555 0.54987 -5.19781 4.51269 -0.68512 -7.23270 6.90055 -0.33215
magnitude: 0.93919 au
magnitude: 2.38723 debye
