program: Orca
programVersion: 5.0.2
elementType: O O O N C C C C C C C C C C C C C C C C C C C C H H H H H H H H H H H H H H H H H H H
charge: 0
multiplicity: 1
keywords: wb97x-d3
keywords: def2-TZVPP
keywords: def2/J RIJCOSX
keywords: DEFGRID2
keywords: scfconv7
keywords: smallprint printgap noloewdin
keywords: NOSOSCF
formula: C20H19NO3
InChI: InChI=1/C20H19NO3/c1-16(23-20-9-5-6-14-21-20)15-22-17-10-12-19(13-11-17)24-18-7-3-2-4-8-18/h2-14,16H,15H2,1H3
43 atoms
O  2.270743 1.662609 0.462935
O  3.618667 -0.838588 0.206415
O  -3.166392 2.482557 0.254545
N  2.47018 -2.773874 -0.239848
C  3.003602 -0.218928 -0.918651
C  3.050722 1.275451 -0.639826
C  3.745968 -0.554996 -2.199697
C  0.935576 1.810294 0.326635
C  0.227363 1.651656 -0.861266
C  0.241797 2.168764 1.481439
C  -1.82379 2.217644 0.260568
C  3.299329 -2.095402 0.521692
C  -1.144021 1.86464 -0.89221
C  -1.125824 2.363909 1.450663
C  -4.036095 1.553323 -0.228173
C  3.887656 -2.623487 1.677558
C  -5.252453 2.029105 -0.70345
C  -3.771971 0.188438 -0.226009
C  3.567043 -3.915443 2.0251
C  2.168141 -4.020303 0.113522
C  2.684137 -4.643606 1.22989
C  -6.20137 1.138009 -1.175938
C  -4.730539 -0.690284 -0.709008
C  -5.945711 -0.225873 -1.187542
H  1.968283 -0.561555 -1.003216
H  4.074743 1.56501 -0.395363
H  2.773654 1.827989 -1.545142
H  4.781761 -0.213975 -2.162269
H  3.741534 -1.628632 -2.376616
H  3.264002 -0.079274 -3.054995
H  0.717312 1.37192 -1.783468
H  0.789295 2.289999 2.406783
H  -1.678775 1.748107 -1.826224
H  -1.656957 2.640627 2.351945
H  4.562522 -2.021225 2.269535
H  -5.445075 3.093948 -0.69709
H  -2.832125 -0.191838 0.1517
H  3.99851 -4.358292 2.913206
H  1.477862 -4.541715 -0.539803
H  2.408805 -5.659691 1.472641
H  -7.145633 1.51602 -1.545346
H  -4.520384 -1.751829 -0.704144
H  -6.686675 -0.91848 -1.562562
totalener: -1054.05585159 hartree
nucrepener: 1885.38584808 hartree
electener: -2939.44169967 hartree
oneelecener: -5176.81853552 hartree
twoeener: 2237.37683585 hartree
kineticenergy: 1049.52839219 hartree
xcener: -102.369648053284 hartree
chargesum: -0.0000000
charge: -0.288362 -0.287859 -0.303096 -0.373593 0.134638 0.017824 -0.282917 0.295357 -0.155662 -0.195302 0.188253 0.418440 -0.195441 -0.151563 0.251560 -0.234699 -0.214446 -0.161095 -0.068352 -0.009681 -0.150896 -0.090595 -0.127007 -0.151101 0.074706 0.112733 0.085264 0.089421 0.104483 0.081908 0.105723 0.119126 0.131149 0.123022 0.122179 0.122984 0.131646 0.128891 0.110735 0.122272 0.122059 0.124688 0.122605
qa: -0.2884 -0.2879 -0.3031 -0.3736 0.1346 0.0178 -0.2829 0.2954 -0.1557 -0.1953 0.1883 0.4184 -0.1954 -0.1516 0.2516 -0.2347 -0.2144 -0.1611 -0.0684 -0.0097 -0.1509 -0.0906 -0.1270 -0.1511 0.0747 0.1127 0.0853 0.0894 0.1045 0.0819 0.1057 0.1191 0.1311 0.1230 0.1222 0.1230 0.1316 0.1289 0.1107 0.1223 0.1221 0.1247 0.1226
va: 2.1223 2.1278 2.0988 2.9865 3.7375 3.9045 3.9550 3.8322 3.8515 4.0275 3.8716 3.9259 4.0416 4.0312 3.8139 3.9943 4.0247 3.9133 3.9238 4.1001 3.8749 3.9405 3.9606 3.9608 1.0447 1.0096 0.9999 1.0070 1.0170 1.0094 1.0141 1.0157 1.0044 1.0103 1.0137 1.0150 1.0061 0.9977 0.9992 1.0034 0.9990 1.0003 1.0010
dispcorr: -0.018045733 hartree
energy: -1054.073897322533
dipole: 4.58119 -4.02920 0.55199 -5.44255 4.75156 -0.69099 -6.91645 6.62614 -0.29031
magnitude: 0.93083 au
magnitude: 2.36598 debye
