program: Orca
programVersion: 5.0.2
elementType: O O O N C C C C C C C C C C C C C C C C C C C C H H H H H H H H H H H H H H H H H H H
charge: 0
multiplicity: 1
keywords: wb97x-d3
keywords: def2-TZVPP
keywords: def2/J RIJCOSX
keywords: DEFGRID2
keywords: scfconv7
keywords: smallprint printgap noloewdin
keywords: NOSOSCF
formula: C20H19NO3
InChI: InChI=1/C20H19NO3/c1-16(23-20-9-5-6-14-21-20)15-22-17-10-12-19(13-11-17)24-18-7-3-2-4-8-18/h2-14,16H,15H2,1H3
43 atoms
O  1.090658 0.396337 -0.590404
O  3.885485 -1.316336 0.784037
O  -3.75686 2.720024 0.570067
N  4.812833 -2.795665 -0.70427
C  3.133321 -0.735711 -0.280504
C  1.929204 -0.117579 0.415205
C  3.960272 0.277329 -1.047816
C  -0.0889 0.947197 -0.237484
C  -0.911161 1.363842 -1.285089
C  -0.519204 1.119366 1.072331
C  -2.567076 2.106321 0.284771
C  4.697154 -2.346128 0.524969
C  -2.137448 1.941451 -1.028377
C  -1.760335 1.693218 1.326284
C  -4.912865 2.184694 0.090544
C  5.385752 -2.898164 1.611871
C  -5.062862 0.832894 -0.196835
C  -5.982877 3.056709 -0.072738
C  6.213266 -3.970493 1.366584
C  5.615885 -3.832877 -0.923566
C  6.337787 -4.461962 0.068875
C  -6.287604 0.366546 -0.652216
C  -7.200165 2.574364 -0.523379
C  -7.360229 1.228141 -0.820636
H  2.788834 -1.519379 -0.960549
H  1.409774 -0.884165 1.003997
H  2.254142 0.674216 1.103252
H  4.80514 -0.204366 -1.536936
H  3.354909 0.751031 -1.819294
H  4.338096 1.057703 -0.38507
H  -0.572352 1.233078 -2.304471
H  0.089968 0.813624 1.91168
H  -2.762809 2.265256 -1.850683
H  -2.094631 1.826032 2.346853
H  5.259355 -2.48895 2.60448
H  -4.238099 0.145015 -0.064591
H  -5.851618 4.106152 0.15664
H  6.7607 -4.426487 2.181104
H  5.678382 -4.17146 -1.951464
H  6.977058 -5.302193 -0.160216
H  -6.39965 -0.686947 -0.873032
H  -8.027538 3.260422 -0.649182
H  -8.310295 0.855381 -1.178389
totalener: -1054.05785404 hartree
nucrepener: 1800.32193604 hartree
electener: -2854.37979008 hartree
oneelecener: -5006.55704895 hartree
twoeener: 2152.17725887 hartree
kineticenergy: 1049.51682193 hartree
xcener: -102.365762840950 hartree
chargesum: -0.0000000
charge: -0.295131 -0.297617 -0.302344 -0.365880 0.146856 0.026450 -0.278386 0.296558 -0.211272 -0.144695 0.185045 0.407118 -0.111996 -0.226974 0.235268 -0.233933 -0.149456 -0.205327 -0.069392 -0.005862 -0.152008 -0.130699 -0.094741 -0.146819 0.064482 0.098296 0.089497 0.098734 0.099041 0.079104 0.120018 0.111234 0.131621 0.124261 0.121846 0.128949 0.123003 0.129856 0.112495 0.123167 0.124314 0.122835 0.122481
qa: -0.2951 -0.2976 -0.3023 -0.3659 0.1469 0.0264 -0.2784 0.2966 -0.2113 -0.1447 0.1850 0.4071 -0.1120 -0.2270 0.2353 -0.2339 -0.1495 -0.2053 -0.0694 -0.0059 -0.1520 -0.1307 -0.0947 -0.1468 0.0645 0.0983 0.0895 0.0987 0.0990 0.0791 0.1200 0.1112 0.1316 0.1243 0.1218 0.1289 0.1230 0.1299 0.1125 0.1232 0.1243 0.1228 0.1225
va: 2.1045 2.1288 2.0940 2.9898 3.8723 3.8559 3.9195 3.8597 4.0283 3.8611 3.8773 3.9425 3.9705 4.0999 3.8219 3.9921 3.9065 4.0182 3.9251 4.0956 3.8772 3.9667 3.9471 3.9581 1.0414 1.0009 0.9944 1.0179 1.0194 1.0099 1.0152 1.0170 1.0017 1.0144 1.0131 1.0068 1.0148 0.9976 0.9990 1.0031 1.0004 0.9988 1.0009
dispcorr: -0.017154633 hartree
energy: -1054.075008671155
dipole: 5.04824 -4.40095 0.64730 -2.67869 1.98648 -0.69221 -2.05815 2.29085 0.23270
magnitude: 0.97586 au
magnitude: 2.48044 debye
