program: Orca
programVersion: 5.0.2
elementType: O O O N C C C C C C C C C C C C C C C C C C C C H H H H H H H H H H H H H H H H H H H
charge: 0
multiplicity: 1
keywords: wb97x-d3
keywords: def2-TZVPP
keywords: def2/J RIJCOSX
keywords: DEFGRID2
keywords: scfconv7
keywords: smallprint printgap noloewdin
keywords: NOSOSCF
formula: C20H19NO3
InChI: InChI=1/C20H19NO3/c1-16(23-20-9-5-6-14-21-20)15-22-17-10-12-19(13-11-17)24-18-7-3-2-4-8-18/h2-14,16H,15H2,1H3
43 atoms
O  2.456639 1.850556 -1.151375
O  3.291349 -0.304091 0.730081
O  -2.298319 0.313759 1.157657
N  2.51285 -1.804785 -0.830511
C  4.141181 0.32603 -0.226392
C  3.663894 1.757884 -0.429168
C  5.558126 0.293014 0.315626
C  1.287205 1.506577 -0.548077
C  0.416401 0.697755 -1.269306
C  0.915755 1.947391 0.715285
C  -1.156693 0.7423 0.537381
C  2.421324 -1.251892 0.356897
C  -0.799788 0.313896 -0.733595
C  -0.304729 1.567112 1.252877
C  -3.486827 0.324923 0.494994
C  1.442289 -1.599513 1.293612
C  -4.402976 -0.660946 0.839248
C  -3.819664 1.291198 -0.447585
C  0.518925 -2.551792 0.929866
C  1.616954 -2.729029 -1.164135
C  0.596862 -3.138354 -0.331396
C  -5.653194 -0.676606 0.242834
C  -5.072488 1.258002 -1.041292
C  -5.994648 0.278818 -0.703235
H  4.092204 -0.208279 -1.177162
H  3.610294 2.269431 0.539538
H  4.401823 2.29168 -1.031191
H  6.250257 0.751365 -0.391076
H  5.63934 0.826537 1.263899
H  5.881451 -0.734225 0.477404
H  0.713046 0.347951 -2.248834
H  1.566325 2.589597 1.293901
H  -1.452237 -0.34018 -1.297394
H  -0.593367 1.904997 2.239661
H  1.407154 -1.105735 2.254031
H  -4.130336 -1.404648 1.576565
H  -3.112219 2.065429 -0.714439
H  -0.267415 -2.830631 1.618769
H  1.727633 -3.159086 -2.153363
H  -0.112648 -3.887135 -0.652998
H  -6.36238 -1.446604 0.517109
H  -5.328824 2.012894 -1.77304
H  -6.969506 0.261655 -1.171138
totalener: -1054.05060619 hartree
nucrepener: 2021.41453984 hartree
electener: -3075.46514603 hartree
oneelecener: -5449.27912802 hartree
twoeener: 2373.81398199 hartree
kineticenergy: 1049.54214774 hartree
xcener: -102.375170581996 hartree
chargesum: -0.0000000
charge: -0.315116 -0.293705 -0.309254 -0.332358 0.146690 0.008619 -0.264804 0.182840 -0.120421 -0.041270 0.262348 0.371077 -0.186664 -0.261916 0.265567 -0.219073 -0.228247 -0.164672 -0.070047 -0.009820 -0.145255 -0.088681 -0.122045 -0.148221 0.082587 0.076763 0.094265 0.080899 0.085402 0.095539 0.120893 0.103442 0.124825 0.121119 0.117930 0.118543 0.131423 0.127766 0.111264 0.120376 0.122712 0.125261 0.123419
qa: -0.3151 -0.2937 -0.3093 -0.3324 0.1467 0.0086 -0.2648 0.1828 -0.1204 -0.0413 0.2623 0.3711 -0.1867 -0.2619 0.2656 -0.2191 -0.2282 -0.1647 -0.0700 -0.0098 -0.1453 -0.0887 -0.1220 -0.1482 0.0826 0.0768 0.0943 0.0809 0.0854 0.0955 0.1209 0.1034 0.1248 0.1211 0.1179 0.1185 0.1314 0.1278 0.1113 0.1204 0.1227 0.1253 0.1234
va: 2.0773 2.1068 2.0729 3.0107 3.7593 3.9278 3.9682 3.8992 3.9499 3.8363 3.7233 4.0010 3.9147 4.0568 3.7972 3.9226 4.0398 3.9293 3.9041 4.0697 3.8376 3.9378 3.9536 3.9612 1.0482 1.0000 1.0063 1.0079 1.0068 1.0102 1.0165 1.0093 1.0074 1.0162 1.0162 1.0168 1.0074 0.9990 0.9995 1.0032 0.9992 1.0003 1.0008
dispcorr: -0.023682832 hartree
energy: -1054.074289018346
dipole: 6.59675 -6.42224 0.17451 0.15170 -0.24534 -0.09364 -0.79027 0.88478 0.09451
magnitude: 0.21944 au
magnitude: 0.55777 debye
