program: Orca
programVersion: 5.0.2
elementType: O O O N C C C C C C C C C C C C C C C C C C C C H H H H H H H H H H H H H H H H H H H
charge: 0
multiplicity: 1
keywords: wb97x-d3
keywords: def2-TZVPP
keywords: def2/J RIJCOSX
keywords: DEFGRID2
keywords: scfconv7
keywords: smallprint printgap noloewdin
keywords: NOSOSCF
formula: C20H19NO3
InChI: InChI=1/C20H19NO3/c1-16(23-20-9-5-6-14-21-20)15-22-17-10-12-19(13-11-17)24-18-7-3-2-4-8-18/h2-14,16H,15H2,1H3
43 atoms
O  1.807354 1.162404 -0.186683
O  4.26977 -1.288472 0.77175
O  -3.416819 2.821882 0.243286
N  3.277955 -2.645071 -0.793079
C  3.75542 -0.14024 0.098804
C  2.309067 0.062996 0.534997
C  4.650378 1.023155 0.47221
C  0.51262 1.505392 -0.030926
C  0.039567 2.526797 -0.852184
C  -0.354238 0.912468 0.882169
C  -2.135597 2.350162 0.145472
C  4.029567 -2.507452 0.276037
C  -1.276084 2.941346 -0.769534
C  -1.671655 1.340882 0.970927
C  -4.463815 1.977174 0.037963
C  4.614411 -3.587473 0.94796
C  -5.684055 2.360631 0.583077
C  -4.3672 0.803603 -0.700927
C  4.382777 -4.849986 0.450887
C  3.068066 -3.871683 -1.263123
C  3.59181 -5.008806 -0.685155
C  -6.803637 1.570159 0.387117
C  -5.497531 0.019517 -0.882237
C  -6.7183 0.392587 -0.342592
H  3.774861 -0.302766 -0.982145
H  1.724179 -0.838319 0.321279
H  2.273748 0.248722 1.616975
H  4.300732 1.936677 -0.004919
H  4.660574 1.1857 1.550947
H  5.673939 0.843426 0.144862
H  0.713305 2.987119 -1.562761
H  -0.024585 0.120301 1.539954
H  -1.640057 3.731839 -1.412557
H  -2.335677 0.879184 1.690564
H  5.22539 -3.420051 1.823876
H  -5.745091 3.277316 1.15493
H  -3.424581 0.5004 -1.136831
H  4.817516 -5.711229 0.941031
H  2.442274 -3.93778 -2.145762
H  3.389831 -5.984421 -1.102971
H  -7.749379 1.87572 0.815228
H  -5.416942 -0.892186 -1.45973
H  -7.593366 -0.225724 -0.489173
totalener: -1054.05792014 hartree
nucrepener: 1834.42519029 hartree
electener: -2888.48311043 hartree
oneelecener: -5074.81360626 hartree
twoeener: 2186.33049583 hartree
kineticenergy: 1049.51996137 hartree
xcener: -102.366451587027 hartree
chargesum: 0.0000000
charge: -0.299230 -0.294598 -0.302672 -0.371175 0.192112 -0.040013 -0.247920 0.299596 -0.201229 -0.152270 0.181945 0.401246 -0.146193 -0.191781 0.250249 -0.236752 -0.210847 -0.159773 -0.067718 -0.009231 -0.152118 -0.092588 -0.129497 -0.150311 0.066414 0.111134 0.090653 0.096453 0.077784 0.091031 0.118239 0.110347 0.123547 0.132230 0.124157 0.122390 0.129417 0.130089 0.114086 0.124145 0.122251 0.123961 0.122438
qa: -0.2992 -0.2946 -0.3027 -0.3712 0.1921 -0.0400 -0.2479 0.2996 -0.2012 -0.1523 0.1819 0.4012 -0.1462 -0.1918 0.2502 -0.2368 -0.2108 -0.1598 -0.0677 -0.0092 -0.1521 -0.0926 -0.1295 -0.1503 0.0664 0.1111 0.0907 0.0965 0.0778 0.0910 0.1182 0.1103 0.1235 0.1322 0.1242 0.1224 0.1294 0.1301 0.1141 0.1241 0.1223 0.1240 0.1224
va: 2.1047 2.1362 2.0980 2.9770 3.8255 3.8564 3.9225 3.8570 4.0168 3.8736 3.8737 3.9428 4.0237 4.0494 3.8169 3.9921 4.0216 3.9100 3.9220 4.0966 3.8777 3.9438 3.9657 3.9605 1.0442 1.0045 0.9921 1.0165 1.0108 1.0107 1.0148 1.0180 1.0102 1.0042 1.0133 1.0153 1.0074 0.9976 0.9989 1.0029 0.9989 1.0005 1.0010
dispcorr: -0.017350613 hartree
energy: -1054.075270751533
dipole: 4.96243 -4.43028 0.53214 -3.48030 2.47068 -1.00962 0.86351 -0.69312 0.17039
magnitude: 1.15392 au
magnitude: 2.93303 debye
