program: Orca
programVersion: 5.0.2
elementType: O O O N C C C C C C C C C C C C C C C C C C C C H H H H H H H H H H H H H H H H H H H
charge: 0
multiplicity: 1
keywords: wb97x-d3
keywords: def2-TZVPP
keywords: def2/J RIJCOSX
keywords: DEFGRID2
keywords: scfconv7
keywords: smallprint printgap noloewdin
keywords: NOSOSCF
formula: C20H19NO3
InChI: InChI=1/C20H19NO3/c1-16(23-20-9-5-6-14-21-20)15-22-17-10-12-19(13-11-17)24-18-7-3-2-4-8-18/h2-14,16H,15H2,1H3
43 atoms
O  2.496123 1.961045 -1.112207
O  3.236797 -0.313606 0.702329
O  -2.238132 0.315712 1.163005
N  2.38882 -1.794861 -0.840611
C  4.089913 0.289695 -0.269416
C  3.701507 1.755434 -0.409805
C  5.521977 0.148001 0.212318
C  1.323727 1.592214 -0.525842
C  0.458513 0.796344 -1.266356
C  0.951423 1.99856 0.74864
C  -1.107541 0.776202 0.54624
C  2.339496 -1.242983 0.349926
C  -0.752972 0.387025 -0.737381
C  -0.262473 1.592054 1.280761
C  -3.422795 0.290309 0.493019
C  1.377636 -1.572595 1.310826
C  -4.293265 -0.748453 0.796616
C  -3.794452 1.272069 -0.418432
C  0.424179 -2.502872 0.968863
C  1.463703 -2.6976 -1.153183
C  0.455862 -3.08609 -0.295803
C  -5.538284 -0.801162 0.190902
C  -5.040541 1.201786 -1.022266
C  -5.917786 0.169361 -0.724601
H  3.970692 -0.210904 -1.232341
H  3.690083 2.228424 0.580241
H  4.466278 2.26568 -0.998581
H  5.677786 0.650398 1.168307
H  5.779312 -0.902764 0.337433
H  6.215546 0.575421 -0.512265
H  0.754986 0.474864 -2.255585
H  1.60035 2.631878 1.339124
H  -1.400438 -0.259308 -1.315322
H  -0.551205 1.899294 2.277517
H  1.379441 -1.082081 2.273423
H  -3.99042 -1.503916 1.509818
H  -3.121336 2.086442 -0.652725
H  -0.349561 -2.767013 1.677419
H  1.538802 -3.127292 -2.145976
H  -0.278619 -3.817412 -0.601318
H  -6.212839 -1.612056 0.432795
H  -5.327502 1.968726 -1.729728
H  -6.88802 0.123299 -1.200028
totalener: -1054.05011630 hartree
nucrepener: 2029.25903782 hartree
electener: -3083.30915412 hartree
oneelecener: -5464.97690489 hartree
twoeener: 2381.66775078 hartree
kineticenergy: 1049.54652756 hartree
xcener: -102.375921590113 hartree
chargesum: 0.0000000
charge: -0.317870 -0.291825 -0.309842 -0.333259 0.139982 0.012413 -0.265427 0.188092 -0.134128 -0.040948 0.256705 0.371058 -0.167776 -0.264436 0.261941 -0.215844 -0.225159 -0.162161 -0.068142 -0.007738 -0.147782 -0.090843 -0.122392 -0.146045 0.083609 0.076362 0.092472 0.085449 0.095384 0.081264 0.120199 0.104008 0.124922 0.120956 0.116880 0.118474 0.131507 0.126585 0.110966 0.120097 0.123043 0.125616 0.123631
qa: -0.3179 -0.2918 -0.3098 -0.3333 0.1400 0.0124 -0.2654 0.1881 -0.1341 -0.0409 0.2567 0.3711 -0.1678 -0.2644 0.2619 -0.2158 -0.2252 -0.1622 -0.0681 -0.0077 -0.1478 -0.0908 -0.1224 -0.1460 0.0836 0.0764 0.0925 0.0854 0.0954 0.0813 0.1202 0.1040 0.1249 0.1210 0.1169 0.1185 0.1315 0.1266 0.1110 0.1201 0.1230 0.1256 0.1236
va: 2.0705 2.1062 2.0675 3.0074 3.7591 3.9259 3.9710 3.9010 3.9618 3.8480 3.7144 4.0016 3.8907 4.0533 3.7998 3.9259 4.0385 3.9319 3.9016 4.0684 3.8371 3.9389 3.9534 3.9593 1.0473 1.0002 1.0062 1.0067 1.0102 1.0080 1.0166 1.0082 1.0078 1.0165 1.0165 1.0163 1.0072 0.9996 0.9995 1.0035 0.9992 1.0002 1.0008
dispcorr: -0.023998204 hartree
energy: -1054.074114502610
dipole: 6.58674 -6.45218 0.13456 -0.40753 0.25931 -0.14821 -0.98317 1.08034 0.09717
magnitude: 0.22252 au
magnitude: 0.56561 debye
