program: Orca
programVersion: 5.0.2
elementType: O O O N C C C C C C C C C C C C C C C C C C C C H H H H H H H H H H H H H H H H H H H
charge: 0
multiplicity: 1
keywords: wb97x-d3
keywords: def2-TZVPP
keywords: def2/J RIJCOSX
keywords: DEFGRID2
keywords: scfconv7
keywords: smallprint printgap noloewdin
keywords: NOSOSCF
formula: C20H19NO3
InChI: InChI=1/C20H19NO3/c1-16(23-20-9-5-6-14-21-20)15-22-17-10-12-19(13-11-17)24-18-7-3-2-4-8-18/h2-14,16H,15H2,1H3
43 atoms
O  1.530792 0.879343 -0.558879
O  4.529727 -0.913089 0.338947
O  -3.587185 2.201095 0.955937
N  3.458611 -2.820556 -0.359184
C  3.671941 -0.123344 -0.484497
C  2.353678 0.076496 0.253601
C  4.403136 1.176262 -0.750715
C  0.282999 1.162281 -0.13432
C  -0.492174 1.957917 -0.978979
C  -0.259467 0.718883 1.06575
C  -2.325824 1.842113 0.564294
C  4.414016 -2.245063 0.335601
C  -1.782588 2.300433 -0.631697
C  -1.565294 1.054133 1.4047
C  -4.651949 1.86816 0.176886
C  5.347583 -2.959266 1.096186
C  -5.815845 2.601818 0.377718
C  -4.628337 0.837939 -0.756319
C  5.24808 -4.332001 1.105781
C  3.379091 -4.148315 -0.342214
C  4.241181 -4.954653 0.370826
C  -6.951467 2.304041 -0.355596
C  -5.773818 0.556746 -1.487488
C  -6.937834 1.283725 -1.296517
H  3.473804 -0.646522 -1.424051
H  1.884783 -0.895546 0.440571
H  2.544492 0.560698 1.220957
H  3.80245 1.826796 -1.383165
H  4.618347 1.708486 0.176952
H  5.346459 0.987978 -1.262433
H  -0.066457 2.309924 -1.909477
H  0.309481 0.105374 1.750184
H  -2.370631 2.924414 -1.292706
H  -1.987888 0.702706 2.336766
H  6.11584 -2.437188 1.649203
H  -5.820201 3.399708 1.108735
H  -3.731778 0.253372 -0.914082
H  5.951056 -4.919699 1.681537
H  2.577104 -4.580428 -0.929656
H  4.132582 -6.02941 0.355681
H  -7.852475 2.880996 -0.19358
H  -5.749462 -0.246283 -2.212559
H  -7.824814 1.057699 -1.872345
totalener: -1054.05814970 hartree
nucrepener: 1826.76692209 hartree
electener: -2880.82507180 hartree
oneelecener: -5059.50071455 hartree
twoeener: 2178.67564275 hartree
kineticenergy: 1049.52415698 hartree
xcener: -102.367444306019 hartree
chargesum: 0.0000000
charge: -0.298529 -0.293124 -0.301591 -0.370888 0.192298 -0.043856 -0.247187 0.300594 -0.208241 -0.141603 0.197108 0.400184 -0.128417 -0.227062 0.256740 -0.235436 -0.215680 -0.164659 -0.069161 -0.009686 -0.150820 -0.089963 -0.130064 -0.151446 0.065885 0.110556 0.093507 0.095272 0.078658 0.090637 0.118435 0.109283 0.130763 0.122746 0.124338 0.122029 0.130252 0.130323 0.114242 0.124048 0.122648 0.124276 0.122591
qa: -0.2985 -0.2931 -0.3016 -0.3709 0.1923 -0.0439 -0.2472 0.3006 -0.2082 -0.1416 0.1971 0.4002 -0.1284 -0.2271 0.2567 -0.2354 -0.2157 -0.1647 -0.0692 -0.0097 -0.1508 -0.0900 -0.1301 -0.1514 0.0659 0.1106 0.0935 0.0953 0.0787 0.0906 0.1184 0.1093 0.1308 0.1227 0.1243 0.1220 0.1303 0.1303 0.1142 0.1240 0.1226 0.1243 0.1226
va: 2.1053 2.1359 2.0977 2.9804 3.8290 3.8525 3.9272 3.8609 4.0197 3.8550 3.8603 3.9465 3.9782 4.1013 3.8102 3.9908 4.0236 3.9135 3.9229 4.0953 3.8774 3.9436 3.9665 3.9633 1.0411 1.0038 0.9938 1.0171 1.0104 1.0108 1.0153 1.0179 1.0017 1.0146 1.0132 1.0157 1.0072 0.9976 0.9989 1.0029 0.9988 1.0005 1.0010
dispcorr: -0.017337740 hartree
energy: -1054.075487443972
dipole: 5.12132 -4.41587 0.70545 -1.28296 0.54293 -0.74003 -2.41252 2.46859 0.05607
magnitude: 1.02394 au
magnitude: 2.60265 debye
