program: Orca
programVersion: 5.0.2
elementType: O O O N C C C C C C C C C C C C C C C C C C C C H H H H H H H H H H H H H H H H H H H
charge: 0
multiplicity: 1
keywords: wb97x-d3
keywords: def2-TZVPP
keywords: def2/J RIJCOSX
keywords: DEFGRID2
keywords: scfconv7
keywords: smallprint printgap noloewdin
keywords: NOSOSCF
formula: C20H19NO3
InChI: InChI=1/C20H19NO3/c1-16(23-20-9-5-6-14-21-20)15-22-17-10-12-19(13-11-17)24-18-7-3-2-4-8-18/h2-14,16H,15H2,1H3
43 atoms
O  2.254785 1.720956 -1.127167
O  2.866669 -0.637336 0.372153
O  -2.834017 2.08333 0.94494
N  3.475457 -2.598955 -0.64873
C  3.866751 0.065105 -0.355796
C  3.4328 1.52109 -0.387345
C  5.229462 -0.083024 0.298177
C  1.036851 1.766964 -0.541587
C  -0.021323 2.073126 -1.397919
C  0.77151 1.560916 0.807289
C  -1.574001 1.950434 0.425635
C  2.663178 -1.937817 0.144313
C  -1.314141 2.167467 -0.922062
C  -0.531835 1.648482 1.280854
C  -3.853103 1.33057 0.450719
C  1.566984 -2.523571 0.788414
C  -5.139225 1.809668 0.674671
C  -3.663884 0.12588 -0.21679
C  1.346131 -3.865234 0.577564
C  3.242987 -3.894167 -0.846356
C  2.200875 -4.580311 -0.25912
C  -6.230969 1.084459 0.229278
C  -4.76891 -0.584923 -0.663293
C  -6.054441 -0.114095 -0.447968
H  3.909964 -0.315653 -1.380237
H  3.360806 1.928192 0.627439
H  4.211058 2.091839 -0.899717
H  5.980882 0.480965 -0.255832
H  5.220697 0.283855 1.325652
H  5.539787 -1.125728 0.305353
H  0.184108 2.244579 -2.446403
H  1.551401 1.301898 1.507035
H  -2.120495 2.413912 -1.601135
H  -0.734018 1.482411 2.33099
H  0.920714 -1.926819 1.41706
H  -5.271961 2.747711 1.197728
H  -2.668115 -0.261003 -0.38831
H  0.509279 -4.356222 1.056716
H  3.93413 -4.401862 -1.509356
H  2.057613 -5.634387 -0.44782
H  -7.228013 1.46588 0.406901
H  -4.615698 -1.521226 -1.18392
H  -6.909257 -0.674691 -0.800848
totalener: -1054.05512859 hartree
nucrepener: 1912.92429079 hartree
electener: -2966.97941938 hartree
oneelecener: -5231.97452994 hartree
twoeener: 2264.99511056 hartree
kineticenergy: 1049.52714260 hartree
xcener: -102.369649961179 hartree
chargesum: 0.0000000
charge: -0.299275 -0.297535 -0.302265 -0.369270 0.159911 0.010850 -0.281639 0.298512 -0.198741 -0.134164 0.210434 0.421050 -0.137780 -0.238985 0.262068 -0.224874 -0.216891 -0.170509 -0.074197 -0.009111 -0.147482 -0.090351 -0.127843 -0.153275 0.065019 0.088870 0.107798 0.084289 0.085148 0.104101 0.117558 0.101975 0.130279 0.122367 0.117600 0.122291 0.129425 0.130103 0.112327 0.122903 0.122717 0.124069 0.122522
qa: -0.2993 -0.2975 -0.3023 -0.3693 0.1599 0.0108 -0.2816 0.2985 -0.1987 -0.1342 0.2104 0.4210 -0.1378 -0.2390 0.2621 -0.2249 -0.2169 -0.1705 -0.0742 -0.0091 -0.1475 -0.0904 -0.1278 -0.1533 0.0650 0.0889 0.1078 0.0843 0.0851 0.1041 0.1176 0.1020 0.1303 0.1224 0.1176 0.1223 0.1294 0.1301 0.1123 0.1229 0.1227 0.1241 0.1225
va: 2.1018 2.1108 2.0976 2.9979 3.7831 3.9111 3.9345 3.8275 4.0262 3.8149 3.8400 3.9260 3.9850 4.0702 3.8086 3.9922 4.0250 3.9157 3.9360 4.0950 3.8764 3.9403 3.9636 3.9626 1.0388 1.0015 1.0010 1.0106 1.0068 1.0196 1.0171 1.0329 1.0014 1.0143 1.0146 1.0155 1.0078 0.9975 1.0002 1.0029 0.9987 1.0003 1.0009
dispcorr: -0.018987991 hartree
energy: -1054.074116577729
dipole: 7.42631 -6.87629 0.55002 -3.77204 3.16726 -0.60478 -0.07459 0.14669 0.07210
magnitude: 0.82066 au
magnitude: 2.08595 debye
