program: Orca
programVersion: 5.0.2
elementType: O O O N C C C C C C C C C C C C C C C C C C C C H H H H H H H H H H H H H H H H H H H
charge: 0
multiplicity: 1
keywords: wb97x-d3
keywords: def2-TZVPP
keywords: def2/J RIJCOSX
keywords: DEFGRID2
keywords: scfconv7
keywords: smallprint printgap noloewdin
keywords: NOSOSCF
formula: C20H19NO3
InChI: InChI=1/C20H19NO3/c1-16(23-20-9-5-6-14-21-20)15-22-17-10-12-19(13-11-17)24-18-7-3-2-4-8-18/h2-14,16H,15H2,1H3
43 atoms
O  2.163976 1.9508 -0.433695
O  2.767553 -0.546674 0.686751
O  -2.930362 -0.14609 -0.500332
N  4.015488 -2.079203 -0.472895
C  3.789293 0.430886 0.544654
C  3.087599 1.778388 0.614158
C  4.838518 0.285133 1.630346
C  0.91912 1.418348 -0.361877
C  0.225826 1.169732 0.819469
C  0.295298 1.154818 -1.576408
C  -1.678078 0.40568 -0.436572
C  2.856926 -1.701094 0.019169
C  -1.060981 0.659363 0.779691
C  -0.998219 0.66129 -1.615506
C  -3.978502 0.501328 0.078897
C  1.679874 -2.446283 -0.108259
C  -5.078024 -0.278617 0.41966
C  -3.998908 1.873364 0.302444
C  1.757564 -3.647023 -0.776951
C  4.070356 -3.240137 -1.120511
C  2.980131 -4.066256 -1.298001
C  -6.193302 0.316013 0.98497
C  -5.121684 2.452224 0.875736
C  -6.221776 1.683219 1.221213
H  4.263402 0.327153 -0.435822
H  2.636621 1.925461 1.601597
H  3.832158 2.566945 0.489407
H  5.350041 -0.67064 1.535682
H  5.588081 1.073704 1.548786
H  4.392646 0.341963 2.624358
H  0.674561 1.34879 1.785976
H  0.832517 1.343496 -2.496495
H  -1.584853 0.459554 1.706036
H  -1.476174 0.460823 -2.565431
H  0.749671 -2.06693 0.292605
H  -5.049658 -1.345017 0.237825
H  -3.151738 2.489342 0.031515
H  0.870002 -4.252952 -0.903536
H  5.042071 -3.516428 -1.513838
H  3.077972 -5.001506 -1.830221
H  -7.0449 -0.297885 1.247517
H  -5.131837 3.520529 1.048084
H  -7.09251 2.14314 1.668065
totalener: -1054.05328052 hartree
nucrepener: 1934.81970271 hartree
electener: -2988.87298323 hartree
oneelecener: -5275.89462830 hartree
twoeener: 2287.02164507 hartree
kineticenergy: 1049.53323397 hartree
xcener: -102.370095980381 hartree
chargesum: -0.0000000
charge: -0.311626 -0.289793 -0.303093 -0.366120 0.161874 0.010316 -0.282299 0.236359 -0.099849 -0.160772 0.192087 0.407893 -0.201003 -0.158261 0.250915 -0.214399 -0.214939 -0.155239 -0.080837 -0.009824 -0.144234 -0.091640 -0.130319 -0.149197 0.059551 0.083082 0.107347 0.103824 0.082834 0.084380 0.101874 0.115322 0.131128 0.122712 0.129288 0.120719 0.129852 0.130328 0.110866 0.121895 0.122545 0.124533 0.121923
qa: -0.3116 -0.2898 -0.3031 -0.3661 0.1619 0.0103 -0.2823 0.2364 -0.0998 -0.1608 0.1921 0.4079 -0.2010 -0.1583 0.2509 -0.2144 -0.2149 -0.1552 -0.0808 -0.0098 -0.1442 -0.0916 -0.1303 -0.1492 0.0596 0.0831 0.1073 0.1038 0.0828 0.0844 0.1019 0.1153 0.1311 0.1227 0.1293 0.1207 0.1299 0.1303 0.1109 0.1219 0.1225 0.1245 0.1219
va: 2.0915 2.1133 2.0920 3.0009 3.7863 3.9288 3.9343 3.8691 3.8422 3.9999 3.8261 3.9442 3.9764 4.0275 3.8127 3.9685 4.0253 3.9062 3.9468 4.0951 3.8737 3.9436 3.9626 3.9597 1.0391 0.9977 1.0029 1.0198 1.0095 1.0081 1.0168 1.0163 1.0045 1.0102 1.0067 1.0159 1.0077 0.9977 1.0005 1.0028 0.9989 1.0004 1.0011
dispcorr: -0.020146791 hartree
energy: -1054.073427314054
dipole: 6.35177 -5.95582 0.39594 1.65082 -1.73678 -0.08596 5.27287 -4.92880 0.34407
magnitude: 0.53155 au
magnitude: 1.35109 debye
